{"text_format":"3","workbook":"xlsx","n_sheets":9,"sheets":["MAIN","data","salary","printF","backE","backN","compEN","reliefC","form10E"],"not_rendered":{"images":15,"macros":1,"defined_names":14},"read":"whole","date_system":"1900"}

{"sheet":"MAIN","index":0,"n_rows":1,"n_cols":1,"rows_kept":1,"merged":[[0,0,0,16]]}
["pksaini"]

{"sheet":"data","index":1,"n_rows":7,"n_cols":458,"rows_kept":7,"merged":[[0,446,0,457],[1,446,1,448],[1,449,1,451],[1,452,1,454],[1,455,1,457],[2,26,2,45],[2,46,2,65],[2,66,2,85],[2,86,2,105],[2,106,2,125],[2,126,2,145],[2,146,2,165],[2,166,2,185],[2,186,2,205],[2,206,2,225],[2,226,2,245],[2,246,2,265],[2,266,2,285],[2,286,2,305],[2,306,2,325],[2,326,2,345],[2,346,2,365],[2,366,2,385],[2,386,2,405],[2,406,2,425],[2,426,2,445]]}
["Col1_1","Col1_2","Col1_3","Col1_4","Col1_5","Col1_6","Col1_7","Col1_8","Col1_9","Col1_10","Col1_11","Col1_12","Col1_13","Col1_14","Col1_15","Col1_16","Col1_17","Col1_18","Col1_19","Col1_20","Col1_21","Col1_22","Col1_23","Col1_24","Col1_25","Col1_26",1,2,3,4,5,6,7,8,9,10,11,12,13,14,15,16,17,18,19,20,{"$nulls":400},"Relief 10E"]
["Col2_1","Col2_2","Col2_3","Col2_4","Col2_5","Col2_6","Col2_7","Col2_8","Col2_9","Col2_10","Col2_11","Col2_12","Col2_13","Col2_14","Col2_15","Col2_16","Col2_17","Col2_18","Col2_19","Col2_20","Col2_21","Col2_22","Col2_23","Col2_24","Col2_25","Col2_26","Col2_27","Col2_28","Col2_29","Col2_30","Col2_31","Col2_32","Col2_33","Col2_34","Col2_35","Col2_36","Col2_37","Col2_38","Col2_39","Col2_40","Col2_41","Col2_42","Col2_43","Col2_44","Col2_45","Col2_46","Col2_47","Col2_48","Col2_49","Col2_50","Col2_51","Col2_52","Col2_53","Col2_54","Col2_55","Col2_56","Col2_57","Col2_58","Col2_59","Col2_60","Col2_61","Col2_62","Col2_63","Col2_64","Col2_65","Col2_66","Col2_67","Col2_68","Col2_69","Col2_70","Col2_71","Col2_72","Col2_73","Col2_74","Col2_75","Col2_76","Col2_77","Col2_78","Col2_79","Col2_80","Col2_81","Col2_82","Col2_83","Col2_84","Col2_85","Col2_86","Col2_87","Col2_88","Col2_89","Col2_90","Col2_91","Col2_92","Col2_93","Col2_94","Col2_95","Col2_96","Col2_97","Col2_98","Col2_99","Col2_100","Col2_101","Col2_102","Col2_103","Col2_104","Col2_105","Col2_106","Col2_107","Col2_108","Col2_109","Col2_110","Col2_111","Col2_112","Col2_113","Col2_114","Col2_115","Col2_116","Col2_117","Col2_118","Col2_119","Col2_120","Col2_121","Col2_122","Col2_123","Col2_124","Col2_125","Col2_126","Col2_127","Col2_128","Col2_129","Col2_130","Col2_131","Col2_132","Col2_133","Col2_134","Col2_135","Col2_136","Col2_137","Col2_138","Col2_139","Col2_140","Col2_141","Col2_142","Col2_143","Col2_144","Col2_145","Col2_146","Col2_147","Col2_148","Col2_149","Col2_150","Col2_151","Col2_152","Col2_153","Col2_154","Col2_155","Col2_156","Col2_157","Col2_158","Col2_159","Col2_160","Col2_161","Col2_162","Col2_163","Col2_164","Col2_165","Col2_166","Col2_167","Col2_168","Col2_169","Col2_170","Col2_171","Col2_172","Col2_173","Col2_174","Col2_175","Col2_176","Col2_177","Col2_178","Col2_179","Col2_180","Col2_181","Col2_182","Col2_183","Col2_184","Col2_185","Col2_186","Col2_187","Col2_188","Col2_189","Col2_190","Col2_191","Col2_192","Col2_193","Col2_194","Col2_195","Col2_196","Col2_197","Col2_198","Col2_199","Col2_200","Col2_201","Col2_202","Col2_203","Col2_204","Col2_205","Col2_206","Col2_207","Col2_208","Col2_209","Col2_210","Col2_211","Col2_212","Col2_213","Col2_214","Col2_215","Col2_216","Col2_217","Col2_218","Col2_219","Col2_220","Col2_221","Col2_222","Col2_223","Col2_224","Col2_225","Col2_226","Col2_227","Col2_228","Col2_229","Col2_230","Col2_231","Col2_232","Col2_233","Col2_234","Col2_235","Col2_236","Col2_237","Col2_238","Col2_239","Col2_240","Col2_241","Col2_242","Col2_243","Col2_244","Col2_245","Col2_246","Col2_247","Col2_248","Col2_249","Col2_250","Col2_251","Col2_252","Col2_253","Col2_254","Col2_255","Col2_256","Col2_257","Col2_258","Col2_259","Col2_260","Col2_261","Col2_262","Col2_263","Col2_264","Col2_265","Col2_266","Col2_267","Col2_268","Col2_269","Col2_270","Col2_271","Col2_272","Col2_273","Col2_274","Col2_275","Col2_276","Col2_277","Col2_278","Col2_279","Col2_280","Col2_281","Col2_282","Col2_283","Col2_284","Col2_285","Col2_286","Col2_287","Col2_288","Col2_289","Col2_290","Col2_291","Col2_292","Col2_293","Col2_294","Col2_295","Col2_296","Col2_297","Col2_298","Col2_299","Col2_300","Col2_301","Col2_302","Col2_303","Col2_304","Col2_305","Col2_306","Col2_307","Col2_308","Col2_309","Col2_310","Col2_311","Col2_312","Col2_313","Col2_314","Col2_315","Col2_316","Col2_317","Col2_318","Col2_319","Col2_320","Col2_321","Col2_322","Col2_323","Col2_324","Col2_325","Col2_326","Col2_327","Col2_328","Col2_329","Col2_330","Col2_331","Col2_332","Col2_333","Col2_334","Col2_335","Col2_336","Col2_337","Col2_338","Col2_339","Col2_340","Col2_341","Col2_342","Col2_343","Col2_344","Col2_345","Col2_346","Col2_347","Col2_348","Col2_349","Col2_350","Col2_351","Col2_352","Col2_353","Col2_354","Col2_355","Col2_356","Col2_357","Col2_358","Col2_359","Col2_360","Col2_361","Col2_362","Col2_363","Col2_364","Col2_365","Col2_366","Col2_367","Col2_368","Col2_369","Col2_370","Col2_371","Col2_372","Col2_373","Col2_374","Col2_375","Col2_376","Col2_377","Col2_378","Col2_379","Col2_380","Col2_381","Col2_382","Col2_383","Col2_384","Col2_385","Col2_386","Col2_387","Col2_388","Col2_389","Col2_390","Col2_391","Col2_392","Col2_393","Col2_394","Col2_395","Col2_396","Col2_397","Col2_398","Col2_399","Col2_400","Col2_401","Col2_402","Col2_403","Col2_404","Col2_405","Col2_406","Col2_407","Col2_408","Col2_409","Col2_410","Col2_411","Col2_412","Col2_413","Col2_414","Col2_415","Col2_416","Col2_417","Col2_418","Col2_419","Col2_420","Col2_421","Col2_422","Col2_423","Col2_424","Col2_425","Col2_426","Col2_427","Col2_428","Col2_429","Col2_430","Col2_431","Col2_432","Col2_433","Col2_434","Col2_435","Col2_436","Col2_437","Col2_438","Col2_439","Col2_440","Col2_441","Col2_442","Col2_443","Col2_444","Col2_445","Col2_446","2020-21",null,null,"2021-22",null,null,"2022-23",null,null,"2023-24"]
["Col3_1","Col3_2","Col3_3","Col3_4","Col3_5","Col3_6","Col3_7","Col3_8","Col3_9","Col3_10","Col3_11","Col3_12","Col3_13","Col3_14","Col3_15","Col3_16","Col3_17","Col3_18","Col3_19","Col3_20","Col3_21","Col3_22","Col3_23","Col3_24","Col3_25","Col3_26",{"$nulls":420},"TI","SA","TR","TI","SA","TR","TI","SA","TR","TI","SA","TR"]
[1,"Pramod Kumar Saini","Teacher","ASDF1234X","GSSS Malutana",49300,7,null,12,700,120000,null,null,50000,{"$nulls":12},49300,49300,49300,49300,50800,50800,50800,50800,50800,50800,50800,50800,{"$nulls":3},0,{"$nulls":5},0,0,0,0,0,0,0,0,0,0,0,{"$nulls":9},0,0,0,0,0,0,0,0,0,0,0,{"$nulls":8},24650,24650,24650,24650,25400,25400,25400,25400,26924,26924,26924,26924,3944,6096,null,0,{"$nulls":4},4437,4437,4437,4437,4572,4572,4572,4572,5080,5080,5080,5080,null,null,0,{"$nulls":6},0,0,0,0,0,0,0,0,0,0,0,{"$nulls":9},0,0,0,0,0,0,0,0,0,0,0,{"$nulls":24},6774,{"$nulls":4},0,0,0,0,0,0,0,0,0,0,0,{"$nulls":9},0,0,0,0,0,0,0,0,0,0,0,{"$nulls":8},5000,5000,5000,5000,5000,5000,2850,2850,2850,2850,2850,2850,3944,6096,null,null,1694,{"$nulls":4},0,0,0,0,0,0,0,0,0,0,0,{"$nulls":8},7000,7000,7000,7000,7000,7000,7000,7000,7000,7000,7000,7000,{"$nulls":9},0,0,0,0,0,0,0,0,0,0,0,{"$nulls":9},700,{"$nulls":18},658,658,658,658,658,658,658,658,658,658,658,658,{"$nulls":9},0,0,0,0,0,0,0,0,0,0,0,{"$nulls":8},4000,4000,4000,4000,4000,4000,4000,3000,3000,3000,3000,3000,{"$nulls":9},0,0,0,0,0,0,0,0,0,0,0,{"$nulls":9},0,0,0,0,0,0,0,0,0,0,0]
[2,"Mukesh Yadav","Sr Teacher","ASDFG1234H","GSSS Malutana",38400,7,null,12,700]
[3,"Puran Chand Meena","Prabodhak","SDFGH4321K","GSSS Malutana",49300,7,null,12,2100,{"$nulls":16},49300,49300,49300,49300,50800,50800,50800,50800,50800,50800,50800,50800,{"$nulls":3},0,{"$nulls":5},0,0,0,0,0,0,0,0,0,0,0,{"$nulls":9},0,0,0,0,0,0,0,0,0,0,0,{"$nulls":8},24650,24650,24650,24650,25400,25400,25400,25400,26924,26924,26924,26924,3944,6096,null,0,{"$nulls":4},4437,4437,4437,4437,4572,4572,4572,4572,5080,5080,5080,5080,null,null,0,{"$nulls":6},0,0,0,0,0,0,0,0,0,0,0,{"$nulls":9},0,0,0,0,0,0,0,0,0,0,0,{"$nulls":24},6774,{"$nulls":4},0,0,0,0,0,0,0,0,0,0,0,{"$nulls":9},0,0,0,0,0,0,0,0,0,0,0,{"$nulls":8},2850,2850,2850,2850,2850,2850,2850,2850,2850,2850,2850,2850,3944,6096,null,null,1694,{"$nulls":4},0,0,0,0,0,0,0,0,0,0,0,{"$nulls":8},3000,3000,3000,3000,3000,3000,3000,3000,3000,3000,3000,3000,{"$nulls":9},0,0,0,0,0,0,0,0,0,0,0,{"$nulls":9},2100,{"$nulls":18},658,658,658,658,658,658,658,658,658,658,658,658,{"$nulls":9},0,0,0,0,0,0,0,0,0,0,0,{"$nulls":9},0,0,0,0,0,0,0,0,0,0,0,{"$nulls":9},0,0,0,0,0,0,0,0,0,0,0,{"$nulls":9},0,0,0,0,0,0,0,0,0,0,0]
[4,"Gyana Ram Gurjar","Teacher","DFGHJK1234K","GSSS Malutana",39800,7,null,12,700]

{"sheet":"salary","index":2,"n_rows":26,"n_cols":27,"rows_kept":26,"merged":[[0,1,0,25],[2,1,2,25],[3,1,4,1],[3,2,3,11],[3,12,4,12],[3,13,3,22],[3,23,4,23],[3,24,4,24],[3,25,4,25]]}
[]
[{"$f":"INDEX(data!$A:$A,MATCH(salary!$B$2,data!$B:$B,0))","v":1},"Pramod Kumar Saini","Select Employee :",{"$nulls":8},{"$f":"\"Desig. : \"&IFERROR(VLOOKUP(A2,pk_Tb,3,0),\"\")","v":"Desig. : Teacher"},null,null,{"$f":"\"PAN : \"&IFERROR(VLOOKUP(A2,pk_Tb,4,0),\"\")","v":"PAN : ASDF1234X"},{"$nulls":11},{"$f":"A2","v":1}]
[]
[null,"Month\nYear","------------------Allowances---------------------",{"$nulls":9},"Total\nAllow","------------------Deductions---------------------",{"$nulls":9},"Total \nDedu","Net\nSalary","TV \nNo"]
[null,null,"Basic",null,null,"DA","HRA","CCA",null,"Bonus","ROP",null,null,"GPF","GPFL","SI","SIL","GIS","RGHS","LIC","ITAX"]
[null,"2024-03-01",49300,null,null,24650,4437,{"$nulls":5},{"$f":"SUM(C6:J6)+L6-K6","v":78387},5000,null,7000,null,null,658,null,4000,null,null,{"$f":"SUM(N6:W6)","v":16658},{"$f":"M6-X6","v":61729}]
[null,"2024-04-01",49300,0,0,24650,4437,0,0,null,0,0,{"$f":"SUM(C7:J7)+L7-K7","v":78387},5000,0,7000,0,700,658,0,4000,0,0,{"$f":"SUM(N7:W7)","v":17358},{"$f":"M7-X7","v":61029}]
[null,"2024-05-01",49300,0,0,24650,4437,0,0,null,0,0,78387,5000,0,7000,0,null,658,0,4000,0,0,16658,61729]
{"$rows_left_out":19}
{"sheet":"printF","index":3,"n_rows":28,"n_cols":496,"rows_kept":28,"merged":[[0,1,0,25],[1,2,1,5],[1,6,1,12],[1,14,1,17],[1,18,1,24],[2,2,2,5],[2,6,2,12],[2,14,2,17],[2,18,2,24],[3,1,4,1],[3,2,3,11],[3,12,4,12],[3,13,3,22],[3,23,4,23],[3,24,4,24],[3,25,4,25]]}
[null,"Annual Salary Statement of the Financial Year 2024-25",{"$nulls":25},{"$f":"INDEX(data!$A:$A,MATCH(printF!$AC$1,data!$B:$B,0))","v":1},"Pramod Kumar Saini",{"$nulls":48},"2024-01-01",50,46,9,9,{"$nulls":412},"Designation","Posting Place"]
[null,null,"Employee Name :",{"$nulls":3},{"$f":"VLOOKUP($AB$1,pk_Tb,2,0)","v":"Pramod Kumar Saini"},{"$nulls":7},"Employee Desig. :",{"$nulls":3},{"$f":"VLOOKUP($AB$1,pk_Tb,3,0)","v":"Teacher"},{"$nulls":58},"2024-02-01",50,46,9,9,{"$nulls":412},"Principal","GSSS Malutana"]
[null,null,"Employee PAN :",{"$nulls":3},{"$f":"VLOOKUP($AB$1,pk_Tb,4,0)","v":"ASDF1234X"},{"$nulls":7},"DDO Office :",{"$nulls":3},{"$f":"VLOOKUP($AB$1,pk_Tb,5,0)","v":"GSSS Malutana"},{"$nulls":58},"2024-03-01",50,50,9,9,{"$nulls":412},"Vice Principal","1A"]
[null,"Month\nYear","------------------Allowances---------------------",{"$nulls":9},"Gross\nAmount","------------------Deductions---------------------",{"$nulls":9},"Total \nDedu","Net\nAmount","TV \nNo",{"$nulls":23},"Pramod Kumar Saini",{"$nulls":10},"50","46",{"$f":"BI4-BJ4","v":4},{"$f":"ROUND(AZ6*BK4/100,0)","v":1972},"9","9",{"$f":"BM4-BN4","v":0},{"$f":"ROUND(AZ6*BO4/100,)","v":0},{"$nulls":9},"2024-04-01",50,50,9,9,{"$nulls":412},"Lecturer","2A"]
[null,null,"Basic",null,null,"DA","HRA","CCA",null,"Bonus","ROP",null,null,"GPF","GPFL","SI","SIL","GIS","RGHS","LIC","ITAX",{"$nulls":28},{"$f":"INDEX(data!A:A,MATCH(printF!AX4,data!B:B,0))","v":1},{"$nulls":10},"50","46",{"$f":"BI5-BJ5","v":4},{"$f":"ROUND(AZ6*BK5/100,0)","v":1972},"9","9",{"$f":"BM5-BN5","v":0},{"$f":"ROUND(AZ6*BO5/100,)","v":0},{"$nulls":9},"2024-05-01",50,50,9,9,{"$nulls":412},"Sr Teacher","3A"]
[null,"2024-03-01",{"$f":"VLOOKUP($AB$1,pk_Tb,AB6,0)","v":49300},{"$f":"VLOOKUP($AB$1,pk_Tb,AC6,0)","v":0},{"$f":"VLOOKUP($AB$1,pk_Tb,AD6,0)","v":0},{"$f":"VLOOKUP($AB$1,pk_Tb,AE6,0)","v":24650},{"$f":"VLOOKUP($AB$1,pk_Tb,AF6,0)","v":4437},{"$f":"VLOOKUP($AB$1,pk_Tb,AG6,0)","v":0},{"$f":"VLOOKUP($AB$1,pk_Tb,AH6,0)","v":0},{"$f":"VLOOKUP($AB$1,pk_Tb,AI6,0)","v":0},{"$f":"VLOOKUP($AB$1,pk_Tb,AJ6,0)","v":0},{"$f":"VLOOKUP($AB$1,pk_Tb,AK6,0)","v":0},{"$f":"SUM(C6:J6)+L6-K6","v":78387},{"$f":"VLOOKUP($AB$1,pk_Tb,AL6,0)","v":5000},{"$f":"VLOOKUP($AB$1,pk_Tb,AM6,0)","v":0},{"$f":"VLOOKUP($AB$1,pk_Tb,AN6,0)","v":7000},{"$f":"VLOOKUP($AB$1,pk_Tb,AO6,0)","v":0},{"$f":"VLOOKUP($AB$1,pk_Tb,AP6,0)","v":0},{"$f":"VLOOKUP($AB$1,pk_Tb,AQ6,0)","v":658},{"$f":"VLOOKUP($AB$1,pk_Tb,AR6,0)","v":0},{"$f":"VLOOKUP($AB$1,pk_Tb,AS6,0)","v":4000},{"$f":"VLOOKUP($AB$1,pk_Tb,AT6,0)","v":0},{"$f":"VLOOKUP($AB$1,pk_Tb,AU6,0)","v":0},{"$f":"SUM(N6:W6)","v":16658},{"$f":"M6-X6","v":61729},{"$f":"VLOOKUP($AB$1,pk_Tb,AV6,0)","v":0},null,27,{"$f":"AB6+20","v":47},{"$f":"AC6+20","v":67},{"$f":"AD6+20","v":87},107,127,147,167,187,207,227,247,267,287,307,327,347,367,387,407,{"$f":"AU6+20","v":427},3,{"$f":"IFERROR(VLOOKUP($AX$5,pk_Tb,1,0),0)","v":1},"2024-03-01",{"$f":"AX11","v":49300},{"$f":"ROUND(AZ6*BJ6/100,0)","v":24650},{"$f":"ROUND(AZ6*BN6/100,0)","v":4437},null,{"$f":"IF(AZ6>167000,10500,IF(AZ6>116000,8900,IF(AZ6>80000,6150,IF(AZ6>72000,4800,BH6))))","v":2850},{"$f":"IF($AZ$6>72000,5000,IF($AZ$6>46500,3000,IF($AZ$6>28500,2200,IF($AZ$6>22000,1200,IF($AZ$6>0,800,0)))))","v":3000},null,{"$f":"IF(AZ6>54000,875,IF(AZ6>33500,658,IF(AZ6>18000,440,IF(AZ6>0,265,0))))","v":658},{"$f":"IF(AZ6>62000,4200,IF(AZ6>51500,3575,IF(AZ6>38500,2850,IF(AZ6>28500,2100,IF(AZ6>23100,1625,1450)))))","v":2850},"50","50",0,{"$f":"ROUND(AZ6*BK6/100,0)","v":0},"9","9",0,{"$f":"ROUND(AZ6*BO6/100,)","v":0},{"$nulls":9},"2024-06-01",50,50,9,9,{"$nulls":412},"Teacher","4A"]
[null,"2024-04-01",49300,0,0,24650,4437,0,0,0,0,0,{"$f":"SUM(C7:J7)+L7-K7","v":78387},5000,0,7000,0,700,658,0,4000,0,0,{"$f":"SUM(N7:W7)","v":17358},{"$f":"M7-X7","v":61029},0,null,28,{"$f":"AB7+20","v":48},68,88,108,128,148,168,188,208,228,248,268,288,308,328,348,{"$f":"AR7+20","v":368},388,408,428,4,{"$f":"IFERROR(VLOOKUP($AX$5,pk_Tb,2,0),0)","v":"Pramod Kumar Saini"},"2024-04-01",{"$f":"AZ6","v":49300},24650,4437,null,2850,{"$f":"IF($AZ$6>72000,5000,IF($AZ$6>46500,3000,IF($AZ$6>28500,2200,IF($AZ$6>22000,1200,IF($AZ$6>0,800,0)))))","v":3000},{"$f":"AX15","v":700},{"$f":"IF(AZ7>54000,875,IF(AZ7>33500,658,IF(AZ7>18000,440,IF(AZ7>0,265,0))))","v":658},2850,"50","50",0,0,"9","9",0,0,{"$nulls":9},"2024-07-01",53,50,9,9,{"$nulls":412},"PET III","5A"]
[null,"2024-05-01",49300,0,0,24650,4437,0,0,0,0,0,78387,5000,0,7000,0,0,658,0,4000,0,0,16658,61729,0,null,29,49,69,89,109,129,149,169,189,209,229,249,269,289,309,329,349,369,389,409,429,5,{"$f":"IFERROR(VLOOKUP($AX$5,pk_Tb,3,0),0)","v":"Teacher"},"2024-05-01",{"$f":"AZ7","v":49300},24650,4437,null,2850,3000,null,658,2850,"50","50",0,0,"9","9",0,0,{"$nulls":9},"2024-08-01",53,50,9,9,{"$nulls":412},"Prabodhak","6A"]
{"$rows_left_out":21}
{"sheet":"backE","index":4,"n_rows":49,"n_cols":27,"rows_kept":49,"merged":[[0,1,0,22],[1,1,1,22],[2,1,2,20],[2,21,2,22],[3,1,3,20],[3,21,3,22],[4,2,4,20],[5,2,5,20],[6,2,6,20],[7,2,7,20],[8,2,8,20],[9,2,9,20],[10,2,10,20],[11,2,11,20],[12,2,12,20],[13,3,13,20],[14,4,14,20],[15,4,15,20],[16,4,16,20],[17,4,17,20],[18,3,18,20],[19,3,19,20],[20,3,20,20],[21,3,21,20],[22,3,22,20],[23,3,23,20],[24,3,24,20],[25,3,25,20],[26,3,26,20],[27,3,27,20],[28,3,28,20],[29,2,29,20],[30,2,30,20],[31,2,31,17],[31,18,31,20],[32,2,32,7],[32,8,32,9],[32,10,32,13],[32,14,32,17],[32,18,32,20],[33,2,33,7],[33,8,33,9],[33,10,33,13],[33,14,33,17],[33,18,33,20],[34,2,34,7],[34,8,34,9],[34,10,34,13],[34,14,34,17],[34,18,34,20],[35,2,35,7],[35,8,35,9],[35,10,35,13],[35,14,35,17],[35,18,35,20],[36,2,36,7],[36,8,36,9],[36,10,36,13],[36,14,36,17],[36,18,36,20],[37,2,37,20],[38,2,38,20],[39,2,39,20],[40,2,40,20],[41,2,41,20],[42,2,42,20],[43,2,43,20],[44,2,44,20],[45,2,45,20],[46,2,46,20]]}
[{"$nulls":24},1,{"$f":"IFERROR(VLOOKUP($AA$1,pk_Tb,Y1,0),\"\")","v":1},{"$f":"printF!AB1","v":1}]
[null,"Income Tax Calculation for Financial Year 2023-24 Assessment Year 2024-25",{"$nulls":22},2,"Pramod Kumar Saini"]
[null,{"$f":"\"Name (Designation) : \"&Z2&\" (\"&Z3&\")\"","v":"Name (Designation) : Pramod Kumar Saini (Teacher)"},{"$nulls":19},{"$f":"\"PAN : \"&Z4","v":"PAN : ASDF1234X"},null,null,3,"Teacher"]
[null,{"$f":"\"DDO Office : \"&Z5","v":"DDO Office : GSSS Malutana"},{"$nulls":19},"As per Old Tax Regime",null,null,4,"ASDF1234X"]
[null,"1.","Gross Salary... (Including all allowance u/s 17... i.e. Govt. contribution towards NPS)",{"$nulls":18},{"$f":"printF!M26","v":{"v":984666,"d":"₹ 984,666"}},null,null,5,"GSSS Malutana"]
[null,"2.","HRA exemption as per eligibility u/s 10(13-A) whether living in … Rented House",{"$nulls":18},{"$f":"IFERROR(MIN(Z11,SUM(salary!G6:G17)),0)","v":{"v":56356,"d":"₹ 56,356"}}]
[null,"3.","Net Salary [1-2]",{"$nulls":19},{"$f":"V5-V6","v":{"v":928310,"d":"₹ 928,310"}}]
[null,"4.","Standard Deduction u/s 16(ia)",{"$nulls":18},{"$f":"MAX(MIN(50000,W7),0)","v":{"v":50000,"d":"₹ 50,000"}}]
{"$rows_left_out":42}
{"sheet":"backN","index":5,"n_rows":51,"n_cols":23,"rows_kept":51,"merged":[[1,1,1,22],[2,1,2,20],[2,21,2,22],[3,1,3,20],[3,21,3,22],[4,2,4,20],[5,2,5,20],[6,2,6,20],[7,2,7,20],[8,2,8,20],[9,2,9,20],[10,2,10,20],[11,2,11,20],[12,2,12,20],[13,3,13,20],[14,4,14,20],[15,4,15,20],[16,4,16,20],[17,4,17,20],[18,3,18,20],[19,3,19,20],[20,3,20,20],[21,3,21,20],[22,3,22,20],[23,3,23,20],[24,3,24,20],[25,3,25,20],[26,3,26,20],[27,3,27,20],[28,3,28,20],[29,2,29,20],[30,2,30,20],[31,2,31,17],[31,18,31,20],[32,2,32,7],[32,8,32,9],[32,10,32,13],[32,14,32,17],[32,18,32,20],[33,2,33,7],[33,8,33,9],[33,10,33,13],[33,14,33,17],[33,18,33,20],[34,2,34,7],[34,8,34,9],[34,10,34,13],[34,14,34,17],[34,18,34,20],[35,2,35,7],[35,8,35,9],[35,10,35,13],[35,14,35,17],[35,18,35,20],[36,2,36,7],[36,8,36,9],[36,10,36,13],[36,14,36,17],[36,18,36,20],[37,2,37,7],[37,8,37,9],[37,10,37,13],[37,14,37,17],[37,18,37,20],[38,2,38,7],[38,8,38,9],[38,10,38,13],[38,14,38,17],[38,18,38,20],[39,2,39,20],[40,2,40,20],[41,2,41,20],[42,2,42,20],[43,2,43,20],[44,2,44,20],[45,2,45,20],[46,2,46,20],[47,2,47,20],[48,2,48,20]]}
[]
[null,"Income Tax Calculation for Financial Year 2024-25 Assessment Year 2025-26"]
[null,{"$f":"backE!B3","v":"Name (Designation) : Pramod Kumar Saini (Teacher)"},{"$nulls":19},{"$f":"backE!V3","v":"PAN : ASDF1234X"}]
[null,{"$f":"backE!B4","v":"DDO Office : GSSS Malutana"},{"$nulls":19},"As per New Tax Regime"]
[null,"1.","Gross Salary... (Including all allowance u/s 17... i.e. Govt. contribution towards NPS)",{"$nulls":18},{"$f":"printF!M26","v":{"v":984666,"d":"₹ 984,666"}}]
[null,"2.","HRA exemption as per eligibility u/s 10(13-A) whether living in … Rented House",{"$nulls":18},0]
[null,"3.","Net Salary [1-2]",{"$nulls":19},{"$f":"V5-V6","v":{"v":984666,"d":"₹ 984,666"}}]
[null,"4.","Standard Deduction u/s 16(ia)",{"$nulls":18},{"$f":"MAX(MIN(W7,75000),0)","v":{"v":75000,"d":"₹ 75,000"}}]
{"$rows_left_out":44}
{"sheet":"compEN","index":6,"n_rows":51,"n_cols":25,"rows_kept":51,"merged":[[1,1,1,22],[2,1,2,11],[2,12,2,20],[2,21,3,21],[2,22,3,22],[3,1,3,11],[3,12,3,20],[4,2,4,20],[5,2,5,20],[6,2,6,20],[7,2,7,20],[8,2,8,20],[9,2,9,20],[10,2,10,20],[11,2,11,20],[12,2,12,20],[13,3,13,20],[14,4,14,20],[15,4,15,20],[16,4,16,20],[17,4,17,20],[18,3,18,20],[19,3,19,20],[20,3,20,20],[21,3,21,20],[22,3,22,20],[23,3,23,20],[24,3,24,20],[25,3,25,20],[26,3,26,20],[27,3,27,20],[28,3,28,20],[29,2,29,20],[30,2,30,20],[31,2,31,10],[31,11,31,19],[32,2,32,5],[32,7,32,8],[32,9,32,10],[32,11,32,14],[32,16,32,17],[32,18,32,19],[33,2,33,5],[33,7,33,8],[33,9,33,10],[33,11,33,14],[33,16,33,17],[33,18,33,19],[34,2,34,5],[34,7,34,8],[34,9,34,10],[34,11,34,14],[34,16,34,17],[34,18,34,19],[35,2,35,5],[35,7,35,8],[35,9,35,10],[35,11,35,14],[35,16,35,17],[35,18,35,19],[36,2,36,5],[36,7,36,8],[36,9,36,10],[36,11,36,14],[36,16,36,17],[36,18,36,19],[37,2,37,10],[37,11,37,14],[37,16,37,17],[37,18,37,19],[38,2,38,10],[38,11,38,14],[38,16,38,17],[38,18,38,19],[39,2,39,20],[40,2,40,20],[41,2,41,20],[42,2,42,20],[43,2,43,20],[44,2,44,20],[45,2,45,20],[46,2,46,20],[47,2,47,20],[48,2,48,20]]}
[]
[null,"Income Tax Camparison for FY 2024-25 Asessment Year 2025-26"]
[null,{"$f":"\"Emp Name : \"&backE!Z2","v":"Emp Name : Pramod Kumar Saini"},{"$nulls":10},{"$f":"\"Emp Desig. : \"&backE!Z3","v":"Emp Desig. : Teacher"},{"$nulls":8},"As per Tax\nOld Regime▼","As per Tax\nNew Regime▼"]
[null,{"$f":"\"Emp PAN : \"&backE!Z4","v":"Emp PAN : ASDF1234X"},{"$nulls":10},{"$f":"\"DDO Office : \"&backE!Z5","v":"DDO Office : GSSS Malutana"}]
[null,"1.","Gross Salary... (Including all allowance u/s 17... i.e. Govt. contribution towards NPS)",{"$nulls":18},{"$f":"backE!V5","v":{"v":984666,"d":"₹ 984,666"}},{"$f":"backN!V5","v":{"v":984666,"d":"₹ 984,666"}}]
[null,"2.","HRA exemption as per eligibility u/s 10(13-A) whether living in … Rented House",{"$nulls":18},{"$f":"backE!V6","v":{"v":56356,"d":"₹ 56,356"}},0]
[null,"3.","Net Salary [1-2]",{"$nulls":18},{"$f":"V5-V6","v":{"v":928310,"d":"₹ 928,310"}},{"$f":"W5-W6","v":{"v":984666,"d":"₹ 984,666"}}]
[null,"4.","Standard Deduction u/s 16(ia)",{"$nulls":18},{"$f":"backE!V8","v":{"v":50000,"d":"₹ 50,000"}},{"$f":"backN!V8","v":{"v":75000,"d":"₹ 75,000"}}]
{"$rows_left_out":44}
{"sheet":"reliefC","index":7,"n_rows":33,"n_cols":9,"rows_kept":33,"merged":[[0,1,0,5],[1,1,1,4],[2,1,2,5],[16,1,16,5],[30,1,30,4]]}
[null,"RELIEF CALCULATION UNDER SECTION 89(1)",{"$nulls":5},{"$f":"INDEX(data!A:A,MATCH(reliefC!I1,data!B:B,0))","v":1},"Pramod Kumar Saini"]
[null,{"$f":"\"Name : \"&I3&\" , PAN : \"&I5","v":"Name : Pramod Kumar Saini , PAN : ASDF1234X"},{"$nulls":3},{"$f":"I18","v":0},null,null,{"$f":"VLOOKUP($H$1,pk_Tb,1,0)","v":1}]
[null,"TAX CALCULATED ON RECEIPT BASIS",{"$nulls":6},{"$f":"VLOOKUP($H$1,pk_Tb,2,0)","v":"Pramod Kumar Saini"}]
[null,"Financial Year","2024-25","2023-24","2022-23","2021-22",null,null,{"$f":"VLOOKUP($H$1,pk_Tb,3,0)","v":"Teacher"}]
[null,"Tax Regime",{"$f":"I18","v":0},{"$f":"I15","v":0},{"$f":"I12","v":0},{"$f":"I9","v":0},null,null,{"$f":"VLOOKUP($H$1,pk_Tb,4,0)","v":"ASDF1234X"}]
[null,"Total Income excluding arrears",{"$f":"C8-C7","v":0},{"$f":"D8","v":0},{"$f":"E8","v":0},{"$f":"F8","v":0},null,null,{"$f":"VLOOKUP($H$1,pk_Tb,5,0)","v":"GSSS Malutana"}]
[null,"Add : Arrears of salary",{"$f":"I17","v":0},{"$nulls":4},447,{"$f":"VLOOKUP($H$1,pk_Tb,H7,0)","v":0}]
[null,"Total Income",{"$f":"I16","v":0},{"$f":"I13","v":0},{"$f":"I10","v":0},{"$f":"I7","v":0},null,448,0]
{"$rows_left_out":26}
{"sheet":"form10E","index":8,"n_rows":53,"n_cols":8,"rows_kept":53,"merged":[[0,1,0,7],[1,1,1,7],[2,1,2,7],[3,1,3,3],[3,5,3,7],[4,1,4,3],[4,5,4,7],[5,1,5,3],[5,5,5,7],[6,1,6,7],[7,1,7,6],[8,1,8,6],[9,1,9,6],[10,1,10,6],[11,1,11,6],[12,1,12,5],[13,1,13,7],[14,1,14,7],[15,1,15,7],[17,2,17,3],[18,2,18,3],[19,1,19,5],[20,1,20,7],[22,1,22,7],[23,1,23,7],[24,1,24,7],[25,2,25,6],[26,2,26,6],[27,2,27,6],[28,2,28,6],[29,2,29,6],[30,2,30,6],[31,2,31,6],[32,2,32,6],[33,2,33,6],[40,1,40,7],[41,1,41,7]]}
[null,"FORM NO.10 E"]
[null,"[See rule 21AA]"]
[null,"Form for furnishing particulars of income under section 192(2A) for the year ending 31 st March, 2025 for claiming relief under section 89(1) by a Government servant or an employee in a Company, Co-operative society, Local authority ,University, Institution, Association or Body."]
[null,"1. Name and Address of the Employee",null,null,":",{"$f":"reliefC!I3","v":"Pramod Kumar Saini"}]
[null,"2. Permanent Account Number",null,null,":",{"$f":"reliefC!I5","v":"ASDF1234X"}]
[null,"3. Residential Status",null,null,":","RESIDENT"]
[null,{"$f":"B6","v":"3. Residential Status"}]
[null,"1. (a) Salary received in arrears or in advance in accordance with the provisions of sub rule (2) of rule 21A",{"$nulls":5},{"$f":"D48","v":0}]
{"$rows_left_out":45}