{"text_format":"3","workbook":"xlsx","n_sheets":17,"sheets":["Sheet1","Sheet2","Sheet3","Sheet4","Sheet5","Sheet6","Sheet7","Sheet8","Sheet9","Sheet10","Sheet11","Sheet12","Sheet13","Sheet14","Sheet15","Sheet16","Sheet17"],"not_rendered":{"images":9,"macros":1,"defined_names":15},"read":"whole","date_system":"1900"}

{"sheet":"Sheet1","index":0,"n_rows":2415,"n_cols":6,"rows_kept":2415,"merged":[[0,1,0,5]]}
[null,"Examination Room and Row-wise Seating Arrangement"]
[null,"Room No","Row No-1","Row No-2","Row No-3","Row No-4"]
{"$rows_empty":11}
[{"$nulls":4},"First Fill Roll Number Series as requirement then select Roll Number Series :"]
[null,"Serial No","Roll Number","Roll No Series-1","Roll No Series-2","Roll No Series-3"]
[null,1,101,101,1001,2001]
[null,2,1001,102,1002,2002]
[null,3,2001,103,1003,2003]
[null,4,102,104,1004,2004]
[null,5,1002,105,1005,2005]
[null,6,2002,106,1006,2006]
[null,7,103,107,1007,2007]
[null,8,1003,108,1008,2008]
[null,9,2003,109,1009,2009]
[null,10,104,110,1010,2010]
[null,11,1004,111,1011,2011]
[null,12,2004,112,1012,2012]
[null,13,105,113,1013,2013]
[null,14,1005,114,1014,2014]
[null,15,2005,115,1015,2015]
[null,16,106,116,1016,2016]
[null,17,1006,117,1017,2017]
[null,18,2006,118,1018,2018]
[null,19,107,119,1019,2019]
[null,20,1007,120,1020,2020]
[null,21,2007,121,1021,2021]
[null,22,108,122,1022,2022]
[null,23,1008,123,1023,2023]
[null,24,2008,124,1024,2024]
[null,25,109,125,1025,2025]
[null,26,1009,126,1026,2026]
[null,27,2009,127,1027,2027]
[null,28,110,128,1028,2028]
[null,29,1010,129,1029,2029]
[null,30,2010,130,1030,2030]
[null,31,111,131,1031,2031]
[null,32,1011,132,1032,2032]
[null,33,2011,133,1033,2033]
[null,34,112,134,1034,2034]
[null,35,1012,135,1035,2035]
[null,36,2012,136,1036,2036]
[null,37,113,137,1037,2037]
[null,38,1013,138,1038,2038]
[null,39,2013,139,1039,2039]
[null,40,114,140,1040,2040]
[null,41,1014,141,1041,2041]
[null,42,2014,142,1042,2042]
[null,43,115,143,1043,2043]
[null,44,1015,144,1044,2044]
[null,45,2015,145,1045,2045]
[null,46,116,146,1046,2046]
[null,47,1016,147,1047,2047]
[null,48,2016,148,1048,2048]
[null,49,117,149,1049,2049]
[null,50,1017,150,1050,2050]
[null,51,2017,151,1051,2051]
[null,52,118,152,1052,2052]
[null,53,1018,153,1053,2053]
[null,54,2018,154,1054,2054]
[null,55,119,155,1055,2055]
[null,56,1019,156,1056,2056]
[null,57,2019,157,1057,2057]
[null,58,120,158,1058,2058]
[null,59,1020,159,1059,2059]
[null,60,2020,160,1060,2060]
[null,61,121,161,1061,2061]
[null,62,1021,162,1062,2062]
[null,63,2021,163,1063,2063]
[null,64,122,164,1064,2064]
[null,65,1022,165,1065,2065]
[null,66,2022,166,1066,2066]
[null,67,123,167,1067,2067]
[null,68,1023,168,1068,2068]
[null,69,2023,169,1069,2069]
[null,70,124,170,1070,2070]
[null,71,1024,171,1071,2071]
[null,72,2024,172,1072,2072]
[null,73,125,173,1073,2073]
[null,74,1025,174,1074,2074]
[null,75,2025,175,1075,2075]
[null,76,126,176,1076,2076]
[null,77,1026,177,1077,2077]
[null,78,2026,178,1078,2078]
[null,79,127,179,1079,2079]
[null,80,1027,180,1080,2080]
[null,81,2027,181,1081,2081]
[null,82,128,182,1082,2082]
[null,83,1028,183,1083,2083]
[null,84,2028,184,1084,2084]
[null,85,129,185,1085,2085]
[null,86,1029,186,1086,2086]
[null,87,2029,187,1087,2087]
[null,88,130,188,1088,2088]
[null,89,1030,189,1089,2089]
[null,90,2030,190,1090,2090]
[null,91,131,191,1091,2091]
[null,92,1031,192,1092,2092]
[null,93,2031,193,1093,2093]
[null,94,132,194,1094,2094]
[null,95,1032,195,1095,2095]
[null,96,2032,196,1096,2096]
[null,97,133,197,1097,2097]
[null,98,1033,198,1098,2098]
[null,99,2033,199,1099,2099]
[null,100,134,200,1100,2100]
[null,101,1034,201,1101,2101]
[null,102,2034,202,1102,2102]
[null,103,135,203,1103,2103]
[null,104,1035,204,1104,2104]
[null,105,2035,205,1105,2105]
[null,106,136,206,1106,2106]
[null,107,1036,207,1107,2107]
[null,108,2036,208,1108,2108]
[null,109,137,209,1109,2109]
[null,110,1037,210,1110,2110]
[null,111,2037,211,1111,2111]
[null,112,138,212,1112,2112]
[null,113,1038,213,1113,2113]
[null,114,2038,214,1114,2114]
[null,115,139,215,1115,2115]
[null,116,1039,216,1116,2116]
[null,117,2039,217,1117,2117]
[null,118,140,218,1118,2118]
[null,119,1040,219,1119,2119]
[null,120,2040,220,1120,2120]
[null,121,141,221,1121,2121]
[null,122,1041,222,1122,2122]
[null,123,2041,223,1123,2123]
[null,124,142,224,1124,2124]
[null,125,1042,225,1125,2125]
[null,126,2042,226,1126,2126]
[null,127,143,227,1127,2127]
[null,128,1043,228,1128,2128]
[null,129,2043,229,1129,2129]
[null,130,144,230,1130,2130]
[null,131,1044,231,1131,2131]
[null,132,2044,232,1132,2132]
[null,133,145,233,1133,2133]
[null,134,1045,234,1134,2134]
[null,135,2045,235,1135,2135]
[null,136,146,236,1136,2136]
[null,137,1046,237,1137,2137]
[null,138,2046,238,1138,2138]
[null,139,147,239,1139,2139]
[null,140,1047,240,1140,2140]
[null,141,2047,241,1141,2141]
[null,142,148,242,1142,2142]
[null,143,1048,243,1143,2143]
[null,144,2048,244,1144,2144]
[null,145,149,245,1145,2145]
[null,146,1049,246,1146,2146]
[null,147,2049,247,1147,2147]
[null,148,150,248,1148,2148]
[null,149,1050,249,1149,2149]
[null,150,2050,250,1150,2150]
[null,151,151,251,1151,2151]
[null,152,1051,252,1152,2152]
[null,153,2051,253,1153,2153]
[null,154,152,254,1154,2154]
[null,155,1052,255,1155,2155]
[null,156,2052,256,1156,2156]
[null,157,153,257,1157,2157]
[null,158,1053,258,1158,2158]
[null,159,2053,259,1159,2159]
[null,160,154,260,1160,2160]
[null,161,1054,261,1161,2161]
[null,162,2054,262,1162,2162]
[null,163,155,263,1163,2163]
[null,164,1055,264,1164,2164]
[null,165,2055,265,1165,2165]
[null,166,156,266,1166,2166]
[null,167,1056,267,1167,2167]
[null,168,2056,268,1168,2168]
[null,169,157,269,1169,2169]
[null,170,1057,270,1170,2170]
[null,171,2057,271,1171,2171]
[null,172,158,272,1172,2172]
[null,173,1058,273,1173,2173]
[null,174,2058,274,1174,2174]
[null,175,159,275,1175,2175]
[null,176,1059,276,1176,2176]
[null,177,2059,277,1177,2177]
[null,178,160,278,1178,2178]
[null,179,1060,279,1179,2179]
[null,180,2060,280,1180,2180]
[null,181,161,281,1181,2181]
[null,182,1061,282,1182,2182]
[null,183,2061,283,1183,2183]
[null,184,162,284,1184,2184]
[null,185,1062,285,1185,2185]
[null,186,2062,286,1186,2186]
[null,187,163,287,1187,2187]
[null,188,1063,288,1188,2188]
[null,189,2063,289,1189,2189]
[null,190,164,290,1190,2190]
[null,191,1064,291,1191,2191]
[null,192,2064,292,1192,2192]
[null,193,165,293,1193,2193]
[null,194,1065,294,1194,2194]
[null,195,2065,295,1195,2195]
[null,196,166,296,1196,2196]
[null,197,1066,297,1197,2197]
[null,198,2066,298,1198,2198]
[null,199,167,299,1199,2199]
[null,200,1067,300,1200,2200]
[null,201,2067,301,1201,2201]
[null,202,168,302,1202,2202]
[null,203,1068,303,1203,2203]
[null,204,2068,304,1204,2204]
[null,205,169,305,1205,2205]
[null,206,1069,306,1206,2206]
[null,207,2069,307,1207,2207]
[null,208,170,308,1208,2208]
[null,209,1070,309,1209,2209]
[null,210,2070,310,1210,2210]
[null,211,171,311,1211,2211]
[null,212,1071,312,1212,2212]
[null,213,2071,313,1213,2213]
[null,214,172,314,1214,2214]
[null,215,1072,315,1215,2215]
[null,216,2072,316,1216,2216]
[null,217,173,317,1217,2217]
[null,218,1073,318,1218,2218]
[null,219,2073,319,1219,2219]
[null,220,174,320,1220,2220]
[null,221,1074,321,1221,2221]
[null,222,2074,322,1222,2222]
[null,223,175,323,1223,2223]
[null,224,1075,324,1224,2224]
[null,225,2075,325,1225,2225]
[null,226,176,326,1226,2226]
[null,227,1076,327,1227,2227]
[null,228,2076,328,1228,2228]
[null,229,177,329,1229,2229]
[null,230,1077,330,1230,2230]
[null,231,2077,331,1231,2231]
[null,232,178,332,1232,2232]
[null,233,1078,333,1233,2233]
[null,234,2078,334,1234,2234]
[null,235,179,335,1235,2235]
[null,236,1079,336,1236,2236]
[null,237,2079,337,1237,2237]
[null,238,180,338,1238,2238]
[null,239,1080,339,1239,2239]
[null,240,2080,340,1240,2240]
[null,241,181,341,1241,2241]
[null,242,1081,342,1242,2242]
[null,243,2081,343,1243,2243]
[null,244,182,344,1244,2244]
[null,245,1082,345,1245,2245]
[null,246,2082,346,1246,2246]
[null,247,183,347,1247,2247]
[null,248,1083,348,1248,2248]
[null,249,2083,349,1249,2249]
[null,250,184,350,1250,2250]
[null,251,1084,351,1251,2251]
[null,252,2084,352,1252,2252]
[null,253,185,353,1253,2253]
[null,254,1085,354,1254,2254]
[null,255,2085,355,1255,2255]
[null,256,186,356,1256,2256]
[null,257,1086,357,1257,2257]
[null,258,2086,358,1258,2258]
[null,259,187,359,1259,2259]
[null,260,1087,360,1260,2260]
[null,261,2087,361,1261,2261]
[null,262,188,362,1262,2262]
[null,263,1088,363,1263,2263]
[null,264,2088,364,1264,2264]
[null,265,189,365,1265,2265]
[null,266,1089,366,1266,2266]
[null,267,2089,367,1267,2267]
[null,268,190,368,1268,2268]
[null,269,1090,369,1269,2269]
[null,270,2090,370,1270,2270]
[null,271,191,371,1271,2271]
[null,272,1091,372,1272,2272]
[null,273,2091,373,1273,2273]
[null,274,192,374,1274,2274]
[null,275,1092,375,1275,2275]
[null,276,2092,376,1276,2276]
[null,277,193,377,1277,2277]
[null,278,1093,378,1278,2278]
[null,279,2093,379,1279,2279]
[null,280,194,380,1280,2280]
[null,281,1094,381,1281,2281]
[null,282,2094,382,1282,2282]
[null,283,195,383,1283,2283]
[null,284,1095,384,1284,2284]
[null,285,2095,385,1285,2285]
[null,286,196,386,1286,2286]
[null,287,1096,387,1287,2287]
[null,288,2096,388,1288,2288]
[null,289,197,389,1289,2289]
[null,290,1097,390,1290,2290]
[null,291,2097,391,1291,2291]
[null,292,198,392,1292,2292]
[null,293,1098,393,1293,2293]
[null,294,2098,394,1294,2294]
[null,295,199,395,1295,2295]
[null,296,1099,396,1296,2296]
[null,297,2099,397,1297,2297]
[null,298,200,398,1298,2298]
[null,299,1100,399,1299,2299]
[null,300,2100,400,1300,2300]
[null,301,201,401,1301,2301]
[null,302,1101,402,1302,2302]
[null,303,2101,403,1303,2303]
[null,304,202,404,1304,2304]
[null,305,1102,405,1305,2305]
[null,306,2102,406,1306,2306]
[null,307,203,407,1307,2307]
[null,308,1103,408,1308,2308]
[null,309,2103,409,1309,2309]
[null,310,204,410,1310,2310]
[null,311,1104,411,1311,2311]
[null,312,2104,412,1312,2312]
[null,313,205,413,1313,2313]
[null,314,1105,414,1314,2314]
[null,315,2105,415,1315,2315]
[null,316,206,416,1316,2316]
[null,317,1106,417,1317,2317]
[null,318,2106,418,1318,2318]
[null,319,207,419,1319,2319]
[null,320,1107,420,1320,2320]
[null,321,2107,421,1321,2321]
[null,322,208,422,1322,2322]
[null,323,1108,423,1323,2323]
[null,324,2108,424,1324,2324]
[null,325,209,425,1325,2325]
[null,326,1109,426,1326,2326]
[null,327,2109,427,1327,2327]
[null,328,210,428,1328,2328]
[null,329,1110,429,1329,2329]
[null,330,2110,430,1330,2330]
[null,331,211,431,1331,2331]
[null,332,1111,432,1332,2332]
[null,333,2111,433,1333,2333]
[null,334,212,434,1334,2334]
[null,335,1112,435,1335,2335]
[null,336,2112,436,1336,2336]
[null,337,213,437,1337,2337]
[null,338,1113,438,1338,2338]
[null,339,2113,439,1339,2339]
[null,340,214,440,1340,2340]
[null,341,1114,441,1341,2341]
[null,342,2114,442,1342,2342]
[null,343,215,443,1343,2343]
[null,344,1115,444,1344,2344]
[null,345,2115,445,1345,2345]
[null,346,216,446,1346,2346]
[null,347,1116,447,1347,2347]
[null,348,2116,448,1348,2348]
[null,349,217,449,1349,2349]
[null,350,1117,450,1350,2350]
[null,351,2117,451,1351,2351]
[null,352,218,452,1352,2352]
[null,353,1118,453,1353,2353]
[null,354,2118,454,1354,2354]
[null,355,219,455,1355,2355]
[null,356,1119,456,1356,2356]
[null,357,2119,457,1357,2357]
[null,358,220,458,1358,2358]
[null,359,1120,459,1359,2359]
[null,360,2120,460,1360,2360]
[null,361,221,461,1361,2361]
[null,362,1121,462,1362,2362]
[null,363,2121,463,1363,2363]
[null,364,222,464,1364,2364]
[null,365,1122,465,1365,2365]
[null,366,2122,466,1366,2366]
[null,367,223,467,1367,2367]
[null,368,1123,468,1368,2368]
[null,369,2123,469,1369,2369]
[null,370,224,470,1370,2370]
[null,371,1124,471,1371,2371]
[null,372,2124,472,1372,2372]
[null,373,225,473,1373,2373]
[null,374,1125,474,1374,2374]
[null,375,2125,475,1375,2375]
[null,376,226,476,1376,2376]
[null,377,1126,477,1377,2377]
[null,378,2126,478,1378,2378]
[null,379,227,479,1379,2379]
[null,380,1127,480,1380,2380]
[null,381,2127,481,1381,2381]
[null,382,228,482,1382,2382]
[null,383,1128,483,1383,2383]
[null,384,2128,484,1384,2384]
[null,385,229,485,1385,2385]
[null,386,1129,486,1386,2386]
[null,387,2129,487,1387,2387]
[null,388,230,488,1388,2388]
[null,389,1130,489,1389,2389]
[null,390,2130,490,1390,2390]
[null,391,231,491,1391,2391]
[null,392,1131,492,1392,2392]
[null,393,2131,493,1393,2393]
[null,394,232,494,1394,2394]
[null,395,1132,495,1395,2395]
[null,396,2132,496,1396,2396]
[null,397,233,497,1397,2397]
[null,398,1133,498,1398,2398]
[null,399,2133,499,1399,2399]
[null,400,234,500,1400,2400]
[null,401,1134,501,1401,2401]
[null,402,2134,502,1402,2402]
[null,403,235,503,1403,2403]
[null,404,1135,504,1404,2404]
[null,405,2135,505,1405,2405]
[null,406,236,506,1406,2406]
[null,407,1136,507,1407,2407]
[null,408,2136,508,1408,2408]
[null,409,237,509,1409,2409]
[null,410,1137,510,1410,2410]
[null,411,2137,511,1411,2411]
[null,412,238,512,1412,2412]
[null,413,1138,513,1413,2413]
[null,414,2138,514,1414,2414]
[null,415,239,515,1415,2415]
[null,416,1139,516,1416,2416]
[null,417,2139,517,1417,2417]
[null,418,240,518,1418,2418]
[null,419,1140,519,1419,2419]
[null,420,2140,520,1420,2420]
[null,421,241,521,1421,2421]
[null,422,1141,522,1422,2422]
[null,423,2141,523,1423,2423]
[null,424,242,524,1424,2424]
[null,425,1142,525,1425,2425]
[null,426,2142,526,1426,2426]
[null,427,243,527,1427,2427]
[null,428,1143,528,1428,2428]
[null,429,2143,529,1429,2429]
[null,430,244,530,1430,2430]
[null,431,1144,531,1431,2431]
[null,432,2144,532,1432,2432]
[null,433,245,533,1433,2433]
[null,434,1145,534,1434,2434]
[null,435,2145,535,1435,2435]
[null,436,246,536,1436,2436]
[null,437,1146,537,1437,2437]
[null,438,2146,538,1438,2438]
[null,439,247,539,1439,2439]
[null,440,1147,540,1440,2440]
[null,441,2147,541,1441,2441]
[null,442,248,542,1442,2442]
[null,443,1148,543,1443,2443]
[null,444,2148,544,1444,2444]
[null,445,249,545,1445,2445]
[null,446,1149,546,1446,2446]
[null,447,2149,547,1447,2447]
[null,448,250,548,1448,2448]
[null,449,1150,549,1449,2449]
[null,450,2150,550,1450,2450]
[null,451,251,551,1451,2451]
[null,452,1151,552,1452,2452]
[null,453,2151,553,1453,2453]
[null,454,252,554,1454,2454]
[null,455,1152,555,1455,2455]
[null,456,2152,556,1456,2456]
[null,457,253,557,1457,2457]
[null,458,1153,558,1458,2458]
[null,459,2153,559,1459,2459]
[null,460,254,560,1460,2460]
[null,461,1154,561,1461,2461]
[null,462,2154,562,1462,2462]
[null,463,255,563,1463,2463]
[null,464,1155,564,1464,2464]
[null,465,2155,565,1465,2465]
[null,466,256,566,1466,2466]
[null,467,1156,567,1467,2467]
[null,468,2156,568,1468,2468]
[null,469,257,569,1469,2469]
[null,470,1157,570,1470,2470]
[null,471,2157,571,1471,2471]
[null,472,258,572,1472,2472]
[null,473,1158,573,1473,2473]
[null,474,2158,574,1474,2474]
[null,475,259,575,1475,2475]
[null,476,1159,576,1476,2476]
[null,477,2159,577,1477,2477]
[null,478,260,578,1478,2478]
[null,479,1160,579,1479,2479]
[null,480,2160,580,1480,2480]
[null,481,261,581,1481,2481]
[null,482,1161,582,1482,2482]
[null,483,2161,583,1483,2483]
[null,484,262,584,1484,2484]
[null,485,1162,585,1485,2485]
[null,486,2162,586,1486,2486]
[null,487,263,587,1487,2487]
[null,488,1163,588,1488,2488]
[null,489,2163,589,1489,2489]
[null,490,264,590,1490,2490]
[null,491,1164,591,1491,2491]
[null,492,2164,592,1492,2492]
[null,493,265,593,1493,2493]
[null,494,1165,594,1494,2494]
[null,495,2165,595,1495,2495]
[null,496,266,596,1496,2496]
[null,497,1166,597,1497,2497]
[null,498,2166,598,1498,2498]
[null,499,267,599,1499,2499]
[null,500,1167,600,1500,2500]
[null,501,2167,601,1501,2501]
[null,502,268,602,1502,2502]
[null,503,1168,603,1503,2503]
[null,504,2168,604,1504,2504]
[null,505,269,605,1505,2505]
[null,506,1169,606,1506,2506]
[null,507,2169,607,1507,2507]
[null,508,270,608,1508,2508]
[null,509,1170,609,1509,2509]
[null,510,2170,610,1510,2510]
[null,511,271,611,1511,2511]
[null,512,1171,612,1512,2512]
[null,513,2171,613,1513,2513]
[null,514,272,614,1514,2514]
[null,515,1172,615,1515,2515]
[null,516,2172,616,1516,2516]
[null,517,273,617,1517,2517]
[null,518,1173,618,1518,2518]
[null,519,2173,619,1519,2519]
[null,520,274,620,1520,2520]
[null,521,1174,621,1521,2521]
[null,522,2174,622,1522,2522]
[null,523,275,623,1523,2523]
[null,524,1175,624,1524,2524]
[null,525,2175,625,1525,2525]
[null,526,276,626,1526,2526]
[null,527,1176,627,1527,2527]
[null,528,2176,628,1528,2528]
[null,529,277,629,1529,2529]
[null,530,1177,630,1530,2530]
[null,531,2177,631,1531,2531]
[null,532,278,632,1532,2532]
[null,533,1178,633,1533,2533]
[null,534,2178,634,1534,2534]
[null,535,279,635,1535,2535]
[null,536,1179,636,1536,2536]
[null,537,2179,637,1537,2537]
[null,538,280,638,1538,2538]
[null,539,1180,639,1539,2539]
[null,540,2180,640,1540,2540]
[null,541,281,641,1541,2541]
[null,542,1181,642,1542,2542]
[null,543,2181,643,1543,2543]
[null,544,282,644,1544,2544]
[null,545,1182,645,1545,2545]
[null,546,2182,646,1546,2546]
[null,547,283,647,1547,2547]
[null,548,1183,648,1548,2548]
[null,549,2183,649,1549,2549]
[null,550,284,650,1550,2550]
[null,551,1184,651,1551,2551]
[null,552,2184,652,1552,2552]
[null,553,285,653,1553,2553]
[null,554,1185,654,1554,2554]
[null,555,2185,655,1555,2555]
[null,556,286,656,1556,2556]
[null,557,1186,657,1557,2557]
[null,558,2186,658,1558,2558]
[null,559,287,659,1559,2559]
[null,560,1187,660,1560,2560]
[null,561,2187,661,1561,2561]
[null,562,288,662,1562,2562]
[null,563,1188,663,1563,2563]
[null,564,2188,664,1564,2564]
[null,565,289,665,1565,2565]
[null,566,1189,666,1566,2566]
[null,567,2189,667,1567,2567]
[null,568,290,668,1568,2568]
[null,569,1190,669,1569,2569]
[null,570,2190,670,1570,2570]
[null,571,291,671,1571,2571]
[null,572,1191,672,1572,2572]
[null,573,2191,673,1573,2573]
[null,574,292,674,1574,2574]
[null,575,1192,675,1575,2575]
[null,576,2192,676,1576,2576]
[null,577,293,677,1577,2577]
[null,578,1193,678,1578,2578]
[null,579,2193,679,1579,2579]
[null,580,294,680,1580,2580]
[null,581,1194,681,1581,2581]
[null,582,2194,682,1582,2582]
[null,583,295,683,1583,2583]
[null,584,1195,684,1584,2584]
[null,585,2195,685,1585,2585]
[null,586,296,686,1586,2586]
[null,587,1196,687,1587,2587]
[null,588,2196,688,1588,2588]
[null,589,297,689,1589,2589]
[null,590,1197,690,1590,2590]
[null,591,2197,691,1591,2591]
[null,592,298,692,1592,2592]
[null,593,1198,693,1593,2593]
[null,594,2198,694,1594,2594]
[null,595,299,695,1595,2595]
[null,596,1199,696,1596,2596]
[null,597,2199,697,1597,2597]
[null,598,300,698,1598,2598]
[null,599,1200,699,1599,2599]
[null,600,2200,700,1600,2600]
[null,601,301,701,1601,2601]
[null,602,1201,702,1602,2602]
[null,603,2201,703,1603,2603]
[null,604,302,704,1604,2604]
[null,605,1202,705,1605,2605]
[null,606,2202,706,1606,2606]
[null,607,303,707,1607,2607]
[null,608,1203,708,1608,2608]
[null,609,2203,709,1609,2609]
[null,610,304,710,1610,2610]
[null,611,1204,711,1611,2611]
[null,612,2204,712,1612,2612]
[null,613,305,713,1613,2613]
[null,614,1205,714,1614,2614]
[null,615,2205,715,1615,2615]
[null,616,306,716,1616,2616]
[null,617,1206,717,1617,2617]
[null,618,2206,718,1618,2618]
[null,619,307,719,1619,2619]
[null,620,1207,720,1620,2620]
[null,621,2207,721,1621,2621]
[null,622,308,722,1622,2622]
[null,623,1208,723,1623,2623]
[null,624,2208,724,1624,2624]
[null,625,309,725,1625,2625]
[null,626,1209,726,1626,2626]
[null,627,2209,727,1627,2627]
[null,628,310,728,1628,2628]
[null,629,1210,729,1629,2629]
[null,630,2210,730,1630,2630]
[null,631,311,731,1631,2631]
[null,632,1211,732,1632,2632]
[null,633,2211,733,1633,2633]
[null,634,312,734,1634,2634]
[null,635,1212,735,1635,2635]
[null,636,2212,736,1636,2636]
[null,637,313,737,1637,2637]
[null,638,1213,738,1638,2638]
[null,639,2213,739,1639,2639]
[null,640,314,740,1640,2640]
[null,641,1214,741,1641,2641]
[null,642,2214,742,1642,2642]
[null,643,315,743,1643,2643]
[null,644,1215,744,1644,2644]
[null,645,2215,745,1645,2645]
[null,646,316,746,1646,2646]
[null,647,1216,747,1647,2647]
[null,648,2216,748,1648,2648]
[null,649,317,749,1649,2649]
[null,650,1217,750,1650,2650]
[null,651,2217,751,1651,2651]
[null,652,318,752,1652,2652]
[null,653,1218,753,1653,2653]
[null,654,2218,754,1654,2654]
[null,655,319,755,1655,2655]
[null,656,1219,756,1656,2656]
[null,657,2219,757,1657,2657]
[null,658,320,758,1658,2658]
[null,659,1220,759,1659,2659]
[null,660,2220,760,1660,2660]
[null,661,321,761,1661,2661]
[null,662,1221,762,1662,2662]
[null,663,2221,763,1663,2663]
[null,664,322,764,1664,2664]
[null,665,1222,765,1665,2665]
[null,666,2222,766,1666,2666]
[null,667,323,767,1667,2667]
[null,668,1223,768,1668,2668]
[null,669,2223,769,1669,2669]
[null,670,324,770,1670,2670]
[null,671,1224,771,1671,2671]
[null,672,2224,772,1672,2672]
[null,673,325,773,1673,2673]
[null,674,1225,774,1674,2674]
[null,675,2225,775,1675,2675]
[null,676,326,776,1676,2676]
[null,677,1226,777,1677,2677]
[null,678,2226,778,1678,2678]
[null,679,327,779,1679,2679]
[null,680,1227,780,1680,2680]
[null,681,2227,781,1681,2681]
[null,682,328,782,1682,2682]
[null,683,1228,783,1683,2683]
[null,684,2228,784,1684,2684]
[null,685,329,785,1685,2685]
[null,686,1229,786,1686,2686]
[null,687,2229,787,1687,2687]
[null,688,330,788,1688,2688]
[null,689,1230,789,1689,2689]
[null,690,2230,790,1690,2690]
[null,691,331,791,1691,2691]
[null,692,1231,792,1692,2692]
[null,693,2231,793,1693,2693]
[null,694,332,794,1694,2694]
[null,695,1232,795,1695,2695]
[null,696,2232,796,1696,2696]
[null,697,333,797,1697,2697]
[null,698,1233,798,1698,2698]
[null,699,2233,799,1699,2699]
[null,700,334,800,1700,2700]
[null,701,1234,801,1701,2701]
[null,702,2234,802,1702,2702]
[null,703,335,803,1703,2703]
[null,704,1235,804,1704,2704]
[null,705,2235,805,1705,2705]
[null,706,336,806,1706,2706]
[null,707,1236,807,1707,2707]
[null,708,2236,808,1708,2708]
[null,709,337,809,1709,2709]
[null,710,1237,810,1710,2710]
[null,711,2237,811,1711,2711]
[null,712,338,812,1712,2712]
[null,713,1238,813,1713,2713]
[null,714,2238,814,1714,2714]
[null,715,339,815,1715,2715]
[null,716,1239,816,1716,2716]
[null,717,2239,817,1717,2717]
[null,718,340,818,1718,2718]
[null,719,1240,819,1719,2719]
[null,720,2240,820,1720,2720]
[null,721,341,821,1721,2721]
[null,722,1241,822,1722,2722]
[null,723,2241,823,1723,2723]
[null,724,342,824,1724,2724]
[null,725,1242,825,1725,2725]
[null,726,2242,826,1726,2726]
[null,727,343,827,1727,2727]
[null,728,1243,828,1728,2728]
[null,729,2243,829,1729,2729]
[null,730,344,830,1730,2730]
[null,731,1244,831,1731,2731]
[null,732,2244,832,1732,2732]
[null,733,345,833,1733,2733]
[null,734,1245,834,1734,2734]
[null,735,2245,835,1735,2735]
[null,736,346,836,1736,2736]
[null,737,1246,837,1737,2737]
[null,738,2246,838,1738,2738]
[null,739,347,839,1739,2739]
[null,740,1247,840,1740,2740]
[null,741,2247,841,1741,2741]
[null,742,348,842,1742,2742]
[null,743,1248,843,1743,2743]
[null,744,2248,844,1744,2744]
[null,745,349,845,1745,2745]
[null,746,1249,846,1746,2746]
[null,747,2249,847,1747,2747]
[null,748,350,848,1748,2748]
[null,749,1250,849,1749,2749]
[null,750,2250,850,1750,2750]
[null,751,351,851,1751,2751]
[null,752,1251,852,1752,2752]
[null,753,2251,853,1753,2753]
[null,754,352,854,1754,2754]
[null,755,1252,855,1755,2755]
[null,756,2252,856,1756,2756]
[null,757,353,857,1757,2757]
[null,758,1253,858,1758,2758]
[null,759,2253,859,1759,2759]
[null,760,354,860,1760,2760]
[null,761,1254,861,1761,2761]
[null,762,2254,862,1762,2762]
[null,763,355,863,1763,2763]
[null,764,1255,864,1764,2764]
[null,765,2255,865,1765,2765]
[null,766,356,866,1766,2766]
[null,767,1256,867,1767,2767]
[null,768,2256,868,1768,2768]
[null,769,357,869,1769,2769]
[null,770,1257,870,1770,2770]
[null,771,2257,871,1771,2771]
[null,772,358,872,1772,2772]
[null,773,1258,873,1773,2773]
[null,774,2258,874,1774,2774]
[null,775,359,875,1775,2775]
[null,776,1259,876,1776,2776]
[null,777,2259,877,1777,2777]
[null,778,360,878,1778,2778]
[null,779,1260,879,1779,2779]
[null,780,2260,880,1780,2780]
[null,781,361,881,1781,2781]
[null,782,1261,882,1782,2782]
[null,783,2261,883,1783,2783]
[null,784,362,884,1784,2784]
[null,785,1262,885,1785,2785]
[null,786,2262,886,1786,2786]
[null,787,363,887,1787,2787]
[null,788,1263,888,1788,2788]
[null,789,2263,889,1789,2789]
[null,790,364,890,1790,2790]
[null,791,1264,891,1791,2791]
[null,792,2264,892,1792,2792]
[null,793,365,893,1793,2793]
[null,794,1265,894,1794,2794]
[null,795,2265,895,1795,2795]
[null,796,366,896,1796,2796]
[null,797,1266,897,1797,2797]
[null,798,2266,898,1798,2798]
[null,799,367,899,1799,2799]
[null,800,1267,900,1800,2800]
[null,null,2267]
[null,null,368]
[null,null,1268]
[null,null,2268]
[null,null,369]
[null,null,1269]
[null,null,2269]
[null,null,370]
[null,null,1270]
[null,null,2270]
[null,null,371]
[null,null,1271]
[null,null,2271]
[null,null,372]
[null,null,1272]
[null,null,2272]
[null,null,373]
[null,null,1273]
[null,null,2273]
[null,null,374]
[null,null,1274]
[null,null,2274]
[null,null,375]
[null,null,1275]
[null,null,2275]
[null,null,376]
[null,null,1276]
[null,null,2276]
[null,null,377]
[null,null,1277]
[null,null,2277]
[null,null,378]
[null,null,1278]
[null,null,2278]
[null,null,379]
[null,null,1279]
[null,null,2279]
[null,null,380]
[null,null,1280]
[null,null,2280]
[null,null,381]
[null,null,1281]
[null,null,2281]
[null,null,382]
[null,null,1282]
[null,null,2282]
[null,null,383]
[null,null,1283]
[null,null,2283]
[null,null,384]
[null,null,1284]
[null,null,2284]
[null,null,385]
[null,null,1285]
[null,null,2285]
[null,null,386]
[null,null,1286]
[null,null,2286]
[null,null,387]
[null,null,1287]
[null,null,2287]
[null,null,388]
[null,null,1288]
[null,null,2288]
[null,null,389]
[null,null,1289]
[null,null,2289]
[null,null,390]
[null,null,1290]
[null,null,2290]
[null,null,391]
[null,null,1291]
[null,null,2291]
[null,null,392]
[null,null,1292]
[null,null,2292]
[null,null,393]
[null,null,1293]
[null,null,2293]
[null,null,394]
[null,null,1294]
[null,null,2294]
[null,null,395]
[null,null,1295]
[null,null,2295]
[null,null,396]
[null,null,1296]
[null,null,2296]
[null,null,397]
[null,null,1297]
[null,null,2297]
[null,null,398]
[null,null,1298]
[null,null,2298]
[null,null,399]
[null,null,1299]
[null,null,2299]
[null,null,400]
[null,null,1300]
[null,null,2300]
[null,null,401]
[null,null,1301]
[null,null,2301]
[null,null,402]
[null,null,1302]
[null,null,2302]
[null,null,403]
[null,null,1303]
[null,null,2303]
[null,null,404]
[null,null,1304]
[null,null,2304]
[null,null,405]
[null,null,1305]
[null,null,2305]
[null,null,406]
[null,null,1306]
[null,null,2306]
[null,null,407]
[null,null,1307]
[null,null,2307]
[null,null,408]
[null,null,1308]
[null,null,2308]
[null,null,409]
[null,null,1309]
[null,null,2309]
[null,null,410]
[null,null,1310]
[null,null,2310]
[null,null,411]
[null,null,1311]
[null,null,2311]
[null,null,412]
[null,null,1312]
[null,null,2312]
[null,null,413]
[null,null,1313]
[null,null,2313]
[null,null,414]
[null,null,1314]
[null,null,2314]
[null,null,415]
[null,null,1315]
[null,null,2315]
[null,null,416]
[null,null,1316]
[null,null,2316]
[null,null,417]
[null,null,1317]
[null,null,2317]
[null,null,418]
[null,null,1318]
[null,null,2318]
[null,null,419]
[null,null,1319]
[null,null,2319]
[null,null,420]
[null,null,1320]
[null,null,2320]
[null,null,421]
[null,null,1321]
[null,null,2321]
[null,null,422]
[null,null,1322]
[null,null,2322]
[null,null,423]
[null,null,1323]
[null,null,2323]
[null,null,424]
[null,null,1324]
[null,null,2324]
[null,null,425]
[null,null,1325]
[null,null,2325]
[null,null,426]
[null,null,1326]
[null,null,2326]
[null,null,427]
[null,null,1327]
[null,null,2327]
[null,null,428]
[null,null,1328]
[null,null,2328]
[3,null,429]
[1,null,1329]
[2,null,2329]
[3,null,430]
[null,null,1330]
[null,null,2330]
[null,null,431]
[null,null,1331]
[null,null,2331]
[null,null,432]
[null,null,1332]
[null,null,2332]
[null,null,433]
[null,null,1333]
[null,null,2333]
[null,null,434]
[null,null,1334]
[null,null,2334]
[null,null,435]
[null,null,1335]
[null,null,2335]
[null,null,436]
[null,null,1336]
[null,null,2336]
[null,null,437]
[null,null,1337]
[null,null,2337]
[null,null,438]
[null,null,1338]
[null,null,2338]
[null,null,439]
[null,null,1339]
[null,null,2339]
[null,null,440]
[null,null,1340]
[null,null,2340]
[null,null,441]
[null,null,1341]
[null,null,2341]
[null,null,442]
[null,null,1342]
[null,null,2342]
[null,null,443]
[null,null,1343]
[null,null,2343]
[null,null,444]
[null,null,1344]
[null,null,2344]
[null,null,445]
[null,null,1345]
[null,null,2345]
[null,null,446]
[null,null,1346]
[null,null,2346]
[null,null,447]
[null,null,1347]
[null,null,2347]
[null,null,448]
[null,null,1348]
[null,null,2348]
[null,null,449]
[null,null,1349]
[null,null,2349]
[null,null,450]
[null,null,1350]
[null,null,2350]
[null,null,451]
[null,null,1351]
[null,null,2351]
[null,null,452]
[null,null,1352]
[null,null,2352]
[null,null,453]
[null,null,1353]
[null,null,2353]
[null,null,454]
[null,null,1354]
[null,null,2354]
[null,null,455]
[null,null,1355]
[null,null,2355]
[null,null,456]
[null,null,1356]
[null,null,2356]
[null,null,457]
[null,null,1357]
[null,null,2357]
[null,null,458]
[null,null,1358]
[null,null,2358]
[null,null,459]
[null,null,1359]
[null,null,2359]
[null,null,460]
[null,null,1360]
[null,null,2360]
[null,null,461]
[null,null,1361]
[null,null,2361]
[null,null,462]
[null,null,1362]
[null,null,2362]
[null,null,463]
[null,null,1363]
[null,null,2363]
[null,null,464]
[null,null,1364]
[null,null,2364]
[null,null,465]
[null,null,1365]
[null,null,2365]
[null,null,466]
[null,null,1366]
[null,null,2366]
[null,null,467]
[null,null,1367]
[null,null,2367]
[null,null,468]
[null,null,1368]
[null,null,2368]
[null,null,469]
[null,null,1369]
[null,null,2369]
[null,null,470]
[null,null,1370]
[null,null,2370]
[null,null,471]
[null,null,1371]
[null,null,2371]
[null,null,472]
[null,null,1372]
[null,null,2372]
[null,null,473]
[null,null,1373]
[null,null,2373]
[null,null,474]
[null,null,1374]
[null,null,2374]
[null,null,475]
[null,null,1375]
[null,null,2375]
[null,null,476]
[null,null,1376]
[null,null,2376]
[null,null,477]
[null,null,1377]
[null,null,2377]
[null,null,478]
[null,null,1378]
[null,null,2378]
[null,null,479]
[null,null,1379]
[null,null,2379]
[null,null,480]
[null,null,1380]
[null,null,2380]
[null,null,481]
[null,null,1381]
[null,null,2381]
[null,null,482]
[null,null,1382]
[null,null,2382]
[null,null,483]
[null,null,1383]
[null,null,2383]
[null,null,484]
[null,null,1384]
[null,null,2384]
[null,null,485]
[null,null,1385]
[null,null,2385]
[null,null,486]
[null,null,1386]
[null,null,2386]
[null,null,487]
[null,null,1387]
[null,null,2387]
[null,null,488]
[null,null,1388]
[null,null,2388]
[null,null,489]
[null,null,1389]
[null,null,2389]
[null,null,490]
[null,null,1390]
[null,null,2390]
[null,null,491]
[null,null,1391]
[null,null,2391]
[null,null,492]
[null,null,1392]
[null,null,2392]
[null,null,493]
[null,null,1393]
[null,null,2393]
[null,null,494]
[null,null,1394]
[null,null,2394]
[null,null,495]
[null,null,1395]
[null,null,2395]
[null,null,496]
[null,null,1396]
[null,null,2396]
[null,null,497]
[null,null,1397]
[null,null,2397]
[null,null,498]
[null,null,1398]
[null,null,2398]
[null,null,499]
[null,null,1399]
[null,null,2399]
[null,null,500]
[null,null,1400]
[null,null,2400]
[null,null,501]
[null,null,1401]
[null,null,2401]
[null,null,502]
[null,null,1402]
[null,null,2402]
[null,null,503]
[null,null,1403]
[null,null,2403]
[null,null,504]
[null,null,1404]
[null,null,2404]
[null,null,505]
[null,null,1405]
[null,null,2405]
[null,null,506]
[null,null,1406]
[null,null,2406]
[null,null,507]
[null,null,1407]
[null,null,2407]
[null,null,508]
[null,null,1408]
[null,null,2408]
[null,null,509]
[null,null,1409]
[null,null,2409]
[null,null,510]
[null,null,1410]
[null,null,2410]
[null,null,511]
[null,null,1411]
[null,null,2411]
[null,null,512]
[null,null,1412]
[null,null,2412]
[null,null,513]
[null,null,1413]
[null,null,2413]
[null,null,514]
[null,null,1414]
[null,null,2414]
[null,null,515]
[null,null,1415]
[null,null,2415]
[null,null,516]
[null,null,1416]
[null,null,2416]
[null,null,517]
[null,null,1417]
[null,null,2417]
[null,null,518]
[null,null,1418]
[null,null,2418]
[null,null,519]
[null,null,1419]
[null,null,2419]
[null,null,520]
[null,null,1420]
[null,null,2420]
[null,null,521]
[null,null,1421]
[null,null,2421]
[null,null,522]
[null,null,1422]
[null,null,2422]
[null,null,523]
[null,null,1423]
[null,null,2423]
[null,null,524]
[null,null,1424]
[null,null,2424]
[null,null,525]
[null,null,1425]
[null,null,2425]
[null,null,526]
[null,null,1426]
[null,null,2426]
[null,null,527]
[null,null,1427]
[null,null,2427]
[null,null,528]
[null,null,1428]
[null,null,2428]
[null,null,529]
[null,null,1429]
[null,null,2429]
[null,null,530]
[null,null,1430]
[null,null,2430]
[null,null,531]
[null,null,1431]
[null,null,2431]
[null,null,532]
[null,null,1432]
[null,null,2432]
[null,null,533]
[null,null,1433]
[null,null,2433]
[null,null,534]
[null,null,1434]
[null,null,2434]
[null,null,535]
[null,null,1435]
[null,null,2435]
[null,null,536]
[null,null,1436]
[null,null,2436]
[null,null,537]
[null,null,1437]
[null,null,2437]
[null,null,538]
[null,null,1438]
[null,null,2438]
[null,null,539]
[null,null,1439]
[null,null,2439]
[null,null,540]
[null,null,1440]
[null,null,2440]
[null,null,541]
[null,null,1441]
[null,null,2441]
[null,null,542]
[null,null,1442]
[null,null,2442]
[null,null,543]
[null,null,1443]
[null,null,2443]
[null,null,544]
[null,null,1444]
[null,null,2444]
[null,null,545]
[null,null,1445]
[null,null,2445]
[null,null,546]
[null,null,1446]
[null,null,2446]
[null,null,547]
[null,null,1447]
[null,null,2447]
[null,null,548]
[null,null,1448]
[null,null,2448]
[null,null,549]
[null,null,1449]
[null,null,2449]
[null,null,550]
[null,null,1450]
[null,null,2450]
[null,null,551]
[null,null,1451]
[null,null,2451]
[null,null,552]
[null,null,1452]
[null,null,2452]
[null,null,553]
[null,null,1453]
[null,null,2453]
[null,null,554]
[null,null,1454]
[null,null,2454]
[null,null,555]
[null,null,1455]
[null,null,2455]
[null,null,556]
[null,null,1456]
[null,null,2456]
[null,null,557]
[null,null,1457]
[null,null,2457]
[null,null,558]
[null,null,1458]
[null,null,2458]
[null,null,559]
[null,null,1459]
[null,null,2459]
[null,null,560]
[null,null,1460]
[null,null,2460]
[null,null,561]
[null,null,1461]
[null,null,2461]
[null,null,562]
[null,null,1462]
[null,null,2462]
[null,null,563]
[null,null,1463]
[null,null,2463]
[null,null,564]
[null,null,1464]
[null,null,2464]
[null,null,565]
[null,null,1465]
[null,null,2465]
[null,null,566]
[null,null,1466]
[null,null,2466]
[null,null,567]
[null,null,1467]
[null,null,2467]
[null,null,568]
[null,null,1468]
[null,null,2468]
[null,null,569]
[null,null,1469]
[null,null,2469]
[null,null,570]
[null,null,1470]
[null,null,2470]
[null,null,571]
[null,null,1471]
[null,null,2471]
[null,null,572]
[null,null,1472]
[null,null,2472]
[null,null,573]
[null,null,1473]
[null,null,2473]
[null,null,574]
[null,null,1474]
[null,null,2474]
[null,null,575]
[null,null,1475]
[null,null,2475]
[null,null,576]
[null,null,1476]
[null,null,2476]
[null,null,577]
[null,null,1477]
[null,null,2477]
[null,null,578]
[null,null,1478]
[null,null,2478]
[null,null,579]
[null,null,1479]
[null,null,2479]
[null,null,580]
[null,null,1480]
[null,null,2480]
[null,null,581]
[null,null,1481]
[null,null,2481]
[null,null,582]
[null,null,1482]
[null,null,2482]
[null,null,583]
[null,null,1483]
[null,null,2483]
[null,null,584]
[null,null,1484]
[null,null,2484]
[null,null,585]
[null,null,1485]
[null,null,2485]
[null,null,586]
[null,null,1486]
[null,null,2486]
[null,null,587]
[null,null,1487]
[null,null,2487]
[null,null,588]
[null,null,1488]
[null,null,2488]
[null,null,589]
[null,null,1489]
[null,null,2489]
[null,null,590]
[null,null,1490]
[null,null,2490]
[null,null,591]
[null,null,1491]
[null,null,2491]
[null,null,592]
[null,null,1492]
[null,null,2492]
[null,null,593]
[null,null,1493]
[null,null,2493]
[null,null,594]
[null,null,1494]
[null,null,2494]
[null,null,595]
[null,null,1495]
[null,null,2495]
[null,null,596]
[null,null,1496]
[null,null,2496]
[null,null,597]
[null,null,1497]
[null,null,2497]
[null,null,598]
[null,null,1498]
[null,null,2498]
[null,null,599]
[null,null,1499]
[null,null,2499]
[null,null,600]
[null,null,1500]
[null,null,2500]
[null,null,601]
[null,null,1501]
[null,null,2501]
[null,null,602]
[null,null,1502]
[null,null,2502]
[null,null,603]
[null,null,1503]
[null,null,2503]
[null,null,604]
[null,null,1504]
[null,null,2504]
[null,null,605]
[null,null,1505]
[null,null,2505]
[null,null,606]
[null,null,1506]
[null,null,2506]
[null,null,607]
[null,null,1507]
[null,null,2507]
[null,null,608]
[null,null,1508]
[null,null,2508]
[null,null,609]
[null,null,1509]
[null,null,2509]
[null,null,610]
[null,null,1510]
[null,null,2510]
[null,null,611]
[null,null,1511]
[null,null,2511]
[null,null,612]
[null,null,1512]
[null,null,2512]
[null,null,613]
[null,null,1513]
[null,null,2513]
[null,null,614]
[null,null,1514]
[null,null,2514]
[null,null,615]
[null,null,1515]
[null,null,2515]
[null,null,616]
[null,null,1516]
[null,null,2516]
[null,null,617]
[null,null,1517]
[null,null,2517]
[null,null,618]
[null,null,1518]
[null,null,2518]
[null,null,619]
[null,null,1519]
[null,null,2519]
[null,null,620]
[null,null,1520]
[null,null,2520]
[null,null,621]
[null,null,1521]
[null,null,2521]
[null,null,622]
[null,null,1522]
[null,null,2522]
[null,null,623]
[null,null,1523]
[null,null,2523]
[null,null,624]
[null,null,1524]
[null,null,2524]
[null,null,625]
[null,null,1525]
[null,null,2525]
[null,null,626]
[null,null,1526]
[null,null,2526]
[null,null,627]
[null,null,1527]
[null,null,2527]
[null,null,628]
[null,null,1528]
[null,null,2528]
[null,null,629]
[null,null,1529]
[null,null,2529]
[null,null,630]
[null,null,1530]
[null,null,2530]
[null,null,631]
[null,null,1531]
[null,null,2531]
[null,null,632]
[null,null,1532]
[null,null,2532]
[null,null,633]
[null,null,1533]
[null,null,2533]
[null,null,634]
[null,null,1534]
[null,null,2534]
[null,null,635]
[null,null,1535]
[null,null,2535]
[null,null,636]
[null,null,1536]
[null,null,2536]
[null,null,637]
[null,null,1537]
[null,null,2537]
[null,null,638]
[null,null,1538]
[null,null,2538]
[null,null,639]
[null,null,1539]
[null,null,2539]
[null,null,640]
[null,null,1540]
[null,null,2540]
[null,null,641]
[null,null,1541]
[null,null,2541]
[null,null,642]
[null,null,1542]
[null,null,2542]
[null,null,643]
[null,null,1543]
[null,null,2543]
[null,null,644]
[null,null,1544]
[null,null,2544]
[null,null,645]
[null,null,1545]
[null,null,2545]
[null,null,646]
[null,null,1546]
[null,null,2546]
[null,null,647]
[null,null,1547]
[null,null,2547]
[null,null,648]
[null,null,1548]
[null,null,2548]
[null,null,649]
[null,null,1549]
[null,null,2549]
[null,null,650]
[null,null,1550]
[null,null,2550]
[null,null,651]
[null,null,1551]
[null,null,2551]
[null,null,652]
[null,null,1552]
[null,null,2552]
[null,null,653]
[null,null,1553]
[null,null,2553]
[null,null,654]
[null,null,1554]
[null,null,2554]
[null,null,655]
[null,null,1555]
[null,null,2555]
[null,null,656]
[null,null,1556]
[null,null,2556]
[null,null,657]
[null,null,1557]
[null,null,2557]
[null,null,658]
[null,null,1558]
[null,null,2558]
[null,null,659]
[null,null,1559]
[null,null,2559]
[null,null,660]
[null,null,1560]
[null,null,2560]
[null,null,661]
[null,null,1561]
[null,null,2561]
[null,null,662]
[null,null,1562]
[null,null,2562]
[null,null,663]
[null,null,1563]
[null,null,2563]
[null,null,664]
[null,null,1564]
[null,null,2564]
[null,null,665]
[null,null,1565]
[null,null,2565]
[null,null,666]
[null,null,1566]
[null,null,2566]
[null,null,667]
[null,null,1567]
[null,null,2567]
[null,null,668]
[null,null,1568]
[null,null,2568]
[null,null,669]
[null,null,1569]
[null,null,2569]
[null,null,670]
[null,null,1570]
[null,null,2570]
[null,null,671]
[null,null,1571]
[null,null,2571]
[null,null,672]
[null,null,1572]
[null,null,2572]
[null,null,673]
[null,null,1573]
[null,null,2573]
[null,null,674]
[null,null,1574]
[null,null,2574]
[null,null,675]
[null,null,1575]
[null,null,2575]
[null,null,676]
[null,null,1576]
[null,null,2576]
[null,null,677]
[null,null,1577]
[null,null,2577]
[null,null,678]
[null,null,1578]
[null,null,2578]
[null,null,679]
[null,null,1579]
[null,null,2579]
[null,null,680]
[null,null,1580]
[null,null,2580]
[null,null,681]
[null,null,1581]
[null,null,2581]
[null,null,682]
[null,null,1582]
[null,null,2582]
[null,null,683]
[null,null,1583]
[null,null,2583]
[null,null,684]
[null,null,1584]
[null,null,2584]
[null,null,685]
[null,null,1585]
[null,null,2585]
[null,null,686]
[null,null,1586]
[null,null,2586]
[null,null,687]
[null,null,1587]
[null,null,2587]
[null,null,688]
[null,null,1588]
[null,null,2588]
[null,null,689]
[null,null,1589]
[null,null,2589]
[null,null,690]
[null,null,1590]
[null,null,2590]
[null,null,691]
[null,null,1591]
[null,null,2591]
[null,null,692]
[null,null,1592]
[null,null,2592]
[null,null,693]
[null,null,1593]
[null,null,2593]
[null,null,694]
[null,null,1594]
[null,null,2594]
[null,null,695]
[null,null,1595]
[null,null,2595]
[null,null,696]
[null,null,1596]
[null,null,2596]
[null,null,697]
[null,null,1597]
[null,null,2597]
[null,null,698]
[null,null,1598]
[null,null,2598]
[null,null,699]
[null,null,1599]
[null,null,2599]
[null,null,700]
[null,null,1600]
[null,null,2600]
[null,null,701]
[null,null,1601]
[null,null,2601]
[null,null,702]
[null,null,1602]
[null,null,2602]
[null,null,703]
[null,null,1603]
[null,null,2603]
[null,null,704]
[null,null,1604]
[null,null,2604]
[null,null,705]
[null,null,1605]
[null,null,2605]
[null,null,706]
[null,null,1606]
[null,null,2606]
[null,null,707]
[null,null,1607]
[null,null,2607]
[null,null,708]
[null,null,1608]
[null,null,2608]
[null,null,709]
[null,null,1609]
[null,null,2609]
[null,null,710]
[null,null,1610]
[null,null,2610]
[null,null,711]
[null,null,1611]
[null,null,2611]
[null,null,712]
[null,null,1612]
[null,null,2612]
[null,null,713]
[null,null,1613]
[null,null,2613]
[null,null,714]
[null,null,1614]
[null,null,2614]
[null,null,715]
[null,null,1615]
[null,null,2615]
[null,null,716]
[null,null,1616]
[null,null,2616]
[null,null,717]
[null,null,1617]
[null,null,2617]
[null,null,718]
[null,null,1618]
[null,null,2618]
[null,null,719]
[null,null,1619]
[null,null,2619]
[null,null,720]
[null,null,1620]
[null,null,2620]
[null,null,721]
[null,null,1621]
[null,null,2621]
[null,null,722]
[null,null,1622]
[null,null,2622]
[null,null,723]
[null,null,1623]
[null,null,2623]
[null,null,724]
[null,null,1624]
[null,null,2624]
[null,null,725]
[null,null,1625]
[null,null,2625]
[null,null,726]
[null,null,1626]
[null,null,2626]
[null,null,727]
[null,null,1627]
[null,null,2627]
[null,null,728]
[null,null,1628]
[null,null,2628]
[null,null,729]
[null,null,1629]
[null,null,2629]
[null,null,730]
[null,null,1630]
[null,null,2630]
[null,null,731]
[null,null,1631]
[null,null,2631]
[null,null,732]
[null,null,1632]
[null,null,2632]
[null,null,733]
[null,null,1633]
[null,null,2633]
[null,null,734]
[null,null,1634]
[null,null,2634]
[null,null,735]
[null,null,1635]
[null,null,2635]
[null,null,736]
[null,null,1636]
[null,null,2636]
[null,null,737]
[null,null,1637]
[null,null,2637]
[null,null,738]
[null,null,1638]
[null,null,2638]
[null,null,739]
[null,null,1639]
[null,null,2639]
[null,null,740]
[null,null,1640]
[null,null,2640]
[null,null,741]
[null,null,1641]
[null,null,2641]
[null,null,742]
[null,null,1642]
[null,null,2642]
[null,null,743]
[null,null,1643]
[null,null,2643]
[null,null,744]
[null,null,1644]
[null,null,2644]
[null,null,745]
[null,null,1645]
[null,null,2645]
[null,null,746]
[null,null,1646]
[null,null,2646]
[null,null,747]
[null,null,1647]
[null,null,2647]
[null,null,748]
[null,null,1648]
[null,null,2648]
[null,null,749]
[null,null,1649]
[null,null,2649]
[null,null,750]
[null,null,1650]
[null,null,2650]
[null,null,751]
[null,null,1651]
[null,null,2651]
[null,null,752]
[null,null,1652]
[null,null,2652]
[null,null,753]
[null,null,1653]
[null,null,2653]
[null,null,754]
[null,null,1654]
[null,null,2654]
[null,null,755]
[null,null,1655]
[null,null,2655]
[null,null,756]
[null,null,1656]
[null,null,2656]
[null,null,757]
[null,null,1657]
[null,null,2657]
[null,null,758]
[null,null,1658]
[null,null,2658]
[null,null,759]
[null,null,1659]
[null,null,2659]
[null,null,760]
[null,null,1660]
[null,null,2660]
[null,null,761]
[null,null,1661]
[null,null,2661]
[null,null,762]
[null,null,1662]
[null,null,2662]
[null,null,763]
[null,null,1663]
[null,null,2663]
[null,null,764]
[null,null,1664]
[null,null,2664]
[null,null,765]
[null,null,1665]
[null,null,2665]
[null,null,766]
[null,null,1666]
[null,null,2666]
[null,null,767]
[null,null,1667]
[null,null,2667]
[null,null,768]
[null,null,1668]
[null,null,2668]
[null,null,769]
[null,null,1669]
[null,null,2669]
[null,null,770]
[null,null,1670]
[null,null,2670]
[null,null,771]
[null,null,1671]
[null,null,2671]
[null,null,772]
[null,null,1672]
[null,null,2672]
[null,null,773]
[null,null,1673]
[null,null,2673]
[null,null,774]
[null,null,1674]
[null,null,2674]
[null,null,775]
[null,null,1675]
[null,null,2675]
[null,null,776]
[null,null,1676]
[null,null,2676]
[null,null,777]
[null,null,1677]
[null,null,2677]
[null,null,778]
[null,null,1678]
[null,null,2678]
[null,null,779]
[null,null,1679]
[null,null,2679]
[null,null,780]
[null,null,1680]
[null,null,2680]
[null,null,781]
[null,null,1681]
[null,null,2681]
[null,null,782]
[null,null,1682]
[null,null,2682]
[null,null,783]
[null,null,1683]
[null,null,2683]
[null,null,784]
[null,null,1684]
[null,null,2684]
[null,null,785]
[null,null,1685]
[null,null,2685]
[null,null,786]
[null,null,1686]
[null,null,2686]
[null,null,787]
[null,null,1687]
[null,null,2687]
[null,null,788]
[null,null,1688]
[null,null,2688]
[null,null,789]
[null,null,1689]
[null,null,2689]
[null,null,790]
[null,null,1690]
[null,null,2690]
[null,null,791]
[null,null,1691]
[null,null,2691]
[null,null,792]
[null,null,1692]
[null,null,2692]
[null,null,793]
[null,null,1693]
[null,null,2693]
[null,null,794]
[null,null,1694]
[null,null,2694]
[null,null,795]
[null,null,1695]
[null,null,2695]
[null,null,796]
[null,null,1696]
[null,null,2696]
[null,null,797]
[null,null,1697]
[null,null,2697]
[null,null,798]
[null,null,1698]
[null,null,2698]
[null,null,799]
[null,null,1699]
[null,null,2699]
[null,null,800]
[null,null,1700]
[null,null,2700]
[null,null,801]
[null,null,1701]
[null,null,2701]
[null,null,802]
[null,null,1702]
[null,null,2702]
[null,null,803]
[null,null,1703]
[null,null,2703]
[null,null,804]
[null,null,1704]
[null,null,2704]
[null,null,805]
[null,null,1705]
[null,null,2705]
[null,null,806]
[null,null,1706]
[null,null,2706]
[null,null,807]
[null,null,1707]
[null,null,2707]
[null,null,808]
[null,null,1708]
[null,null,2708]
[null,null,809]
[null,null,1709]
[null,null,2709]
[null,null,810]
[null,null,1710]
[null,null,2710]
[null,null,811]
[null,null,1711]
[null,null,2711]
[null,null,812]
[null,null,1712]
[null,null,2712]
[null,null,813]
[null,null,1713]
[null,null,2713]
[null,null,814]
[null,null,1714]
[null,null,2714]
[null,null,815]
[null,null,1715]
[null,null,2715]
[null,null,816]
[null,null,1716]
[null,null,2716]
[null,null,817]
[null,null,1717]
[null,null,2717]
[null,null,818]
[null,null,1718]
[null,null,2718]
[null,null,819]
[null,null,1719]
[null,null,2719]
[null,null,820]
[null,null,1720]
[null,null,2720]
[null,null,821]
[null,null,1721]
[null,null,2721]
[null,null,822]
[null,null,1722]
[null,null,2722]
[null,null,823]
[null,null,1723]
[null,null,2723]
[null,null,824]
[null,null,1724]
[null,null,2724]
[null,null,825]
[null,null,1725]
[null,null,2725]
[null,null,826]
[null,null,1726]
[null,null,2726]
[null,null,827]
[null,null,1727]
[null,null,2727]
[null,null,828]
[null,null,1728]
[null,null,2728]
[null,null,829]
[null,null,1729]
[null,null,2729]
[null,null,830]
[null,null,1730]
[null,null,2730]
[null,null,831]
[null,null,1731]
[null,null,2731]
[null,null,832]
[null,null,1732]
[null,null,2732]
[null,null,833]
[null,null,1733]
[null,null,2733]
[null,null,834]
[null,null,1734]
[null,null,2734]
[null,null,835]
[null,null,1735]
[null,null,2735]
[null,null,836]
[null,null,1736]
[null,null,2736]
[null,null,837]
[null,null,1737]
[null,null,2737]
[null,null,838]
[null,null,1738]
[null,null,2738]
[null,null,839]
[null,null,1739]
[null,null,2739]
[null,null,840]
[null,null,1740]
[null,null,2740]
[null,null,841]
[null,null,1741]
[null,null,2741]
[null,null,842]
[null,null,1742]
[null,null,2742]
[null,null,843]
[null,null,1743]
[null,null,2743]
[null,null,844]
[null,null,1744]
[null,null,2744]
[null,null,845]
[null,null,1745]
[null,null,2745]
[null,null,846]
[null,null,1746]
[null,null,2746]
[null,null,847]
[null,null,1747]
[null,null,2747]
[null,null,848]
[null,null,1748]
[null,null,2748]
[null,null,849]
[null,null,1749]
[null,null,2749]
[null,null,850]
[null,null,1750]
[null,null,2750]
[null,null,851]
[null,null,1751]
[null,null,2751]
[null,null,852]
[null,null,1752]
[null,null,2752]
[null,null,853]
[null,null,1753]
[null,null,2753]
[null,null,854]
[null,null,1754]
[null,null,2754]
[null,null,855]
[null,null,1755]
[null,null,2755]
[null,null,856]
[null,null,1756]
[null,null,2756]
[null,null,857]
[null,null,1757]
[null,null,2757]
[null,null,858]
[null,null,1758]
[null,null,2758]
[null,null,859]
[null,null,1759]
[null,null,2759]
[null,null,860]
[null,null,1760]
[null,null,2760]
[null,null,861]
[null,null,1761]
[null,null,2761]
[null,null,862]
[null,null,1762]
[null,null,2762]
[null,null,863]
[null,null,1763]
[null,null,2763]
[null,null,864]
[null,null,1764]
[null,null,2764]
[null,null,865]
[null,null,1765]
[null,null,2765]
[null,null,866]
[null,null,1766]
[null,null,2766]
[null,null,867]
[null,null,1767]
[null,null,2767]
[null,null,868]
[null,null,1768]
[null,null,2768]
[null,null,869]
[null,null,1769]
[null,null,2769]
[null,null,870]
[null,null,1770]
[null,null,2770]
[null,null,871]
[null,null,1771]
[null,null,2771]
[null,null,872]
[null,null,1772]
[null,null,2772]
[null,null,873]
[null,null,1773]
[null,null,2773]
[null,null,874]
[null,null,1774]
[null,null,2774]
[null,null,875]
[null,null,1775]
[null,null,2775]
[null,null,876]
[null,null,1776]
[null,null,2776]
[null,null,877]
[null,null,1777]
[null,null,2777]
[null,null,878]
[null,null,1778]
[null,null,2778]
[null,null,879]
[null,null,1779]
[null,null,2779]
[null,null,880]
[null,null,1780]
[null,null,2780]
[null,null,881]
[null,null,1781]
[null,null,2781]
[null,null,882]
[null,null,1782]
[null,null,2782]
[null,null,883]
[null,null,1783]
[null,null,2783]
[null,null,884]
[null,null,1784]
[null,null,2784]
[null,null,885]
[null,null,1785]
[null,null,2785]
[null,null,886]
[null,null,1786]
[null,null,2786]
[null,null,887]
[null,null,1787]
[null,null,2787]
[null,null,888]
[null,null,1788]
[null,null,2788]
[null,null,889]
[null,null,1789]
[null,null,2789]
[null,null,890]
[null,null,1790]
[null,null,2790]
[null,null,891]
[null,null,1791]
[null,null,2791]
[null,null,892]
[null,null,1792]
[null,null,2792]
[null,null,893]
[null,null,1793]
[null,null,2793]
[null,null,894]
[null,null,1794]
[null,null,2794]
[null,null,895]
[null,null,1795]
[null,null,2795]
[null,null,896]
[null,null,1796]
[null,null,2796]
[null,null,897]
[null,null,1797]
[null,null,2797]
[null,null,898]
[null,null,1798]
[null,null,2798]
[null,null,899]
[null,null,1799]
[null,null,2799]
[null,null,900]
[null,null,1800]
[null,null,2800]

{"sheet":"Sheet2","index":1,"n_rows":37,"n_cols":15,"rows_kept":37,"merged":[[0,1,0,4],[1,1,1,4],[2,1,2,4],[3,1,3,4],[4,1,4,4],[5,1,5,4],[7,1,7,4],[8,1,8,2],[8,3,8,4],[9,1,9,4],[10,1,10,4],[11,1,11,4]]}
[null,{"$f":"$J$1","v":"Half Yearly Examination 2024"},{"$nulls":7},"Half Yearly Examination 2024",1,6,6,6,6]
[null,"परीक्षा केंद्र नाम एवं परीक्षा केंद्र क्रमांक",{"$nulls":7},"Govt Sr Sc School Malutana",2,6,6,5,7]
[null,{"$f":"$J$2&\" (\"&$J$3&\")\"","v":"Govt Sr Sc School Malutana (216405)"},{"$nulls":7},216405,3,5,5,5,8]
[null,"परीक्षा कक्ष / हॉल क्रमांक",{"$nulls":7},"XYZ",4,10,11,12,9]
[null,{"$f":"$K$1","v":{"v":1,"d":"01"}},{"$nulls":7},"Principal",5,14,15,20,13]
[null,"परीक्षा दिनांक (दिवस) ... से ... तक",{"$nulls":7},"XYZ",6,21,20,10,20]
[null,{"$f":"TEXT($J$8,\"DD-MM-YYYY\")","v":"14-12-2024"},{"$f":"IF(B7=\"\",\"\",TEXT(B7,\"DDDD\"))","v":"Saturday"},{"$f":"TEXT($J$9,\"DD-MM-YYYY\")","v":"24-12-2024"},{"$f":"IF(D7=\"\",\"\",TEXT(D7,\"DDDD\"))","v":"Tuesday"},{"$nulls":4},"Lecturer",7,10,10,10,10]
[null,"परीक्षार्थी रोल नंबर ... से ... तक",{"$nulls":7},"2024-12-14",8,6,0,0,11]
[null,{"$f":"IF(B14>0,B15,IF(C14>0,C15,IF(D14>0,D15,IF(E14>0,E15,0))))","v":101},null,{"$f":"IF(E14>0,LOOKUP(2,1/(E15:E34<>\"\"),E15:E34),IF(D14>0,LOOKUP(2,1/(D15:D34<>\"\"),D15:D34),IF(C14>0,LOOKUP(2,1/(C15:C34<>\"\"),C15:C34),IF(B14>0,LOOKUP(2,1/(B15:B34<>\"\"),B15:B34),0))))","v":2008},{"$nulls":5},"2024-12-24",9,6,5,5,5]
[null,"कुल सम्मिलित परीक्षार्थी ",{"$nulls":7},"II",10,1,1,2,9]
[null,{"$f":"COUNTIF(B15:E34,\">0\")","v":24}]
[null,"परीक्षार्थी बैठक व्यवस्था"]
[null,"पंक्ति 1","पंक्ति 2","पंक्ति 3","पंक्ति 4"]
[null,{"$f":"L1","v":6},{"$f":"M1","v":6},6,6]
[null,{"$f":"IF(ROW(B1)-1>=$B$14,\"\",OFFSET(INDIRECT(MID(CELL(\"filename\",Sheet1!$A$15),FIND(\"]\",CELL(\"filename\",Sheet1!$A$15))+1,31)&\"!\"&ADDRESS(16,3,4)),ROW(B1)-1,0))","v":101},{"$f":"IF(ROW(B1)-1>=$C$14,\"\",OFFSET(INDIRECT(MID(CELL(\"filename\",Sheet1!$A$15),FIND(\"]\",CELL(\"filename\",Sheet1!$A$15))+1,31)&\"!\"&ADDRESS(16,3,4)),ROW(B1)-1+SUM($B$14:$B$14),0))","v":103},{"$f":"IF(ROW(B1)-1>=$D$14,\"\",OFFSET(INDIRECT(MID(CELL(\"filename\",Sheet1!$A$15),FIND(\"]\",CELL(\"filename\",Sheet1!$A$15))+1,31)&\"!\"&ADDRESS(16,3,4)),ROW(B1)-1+SUM($B$14:$C$14),0))","v":105},{"$f":"IF(ROW(B1)-1>=$E$14,\"\",OFFSET(INDIRECT(MID(CELL(\"filename\",Sheet1!$A$15),FIND(\"]\",CELL(\"filename\",Sheet1!$A$15))+1,31)&\"!\"&ADDRESS(16,3,4)),ROW(B1)-1+SUM($B$14:$D$14),0))","v":107},{"$f":"IF(SUM(B15:E15)>0,1,\"\")","v":1}]
[null,{"$f":"IF(ROW(B2)-1>=$B$14,\"\",OFFSET(INDIRECT(MID(CELL(\"filename\",Sheet1!$A$15),FIND(\"]\",CELL(\"filename\",Sheet1!$A$15))+1,31)&\"!\"&ADDRESS(16,3,4)),ROW(B2)-1,0))","v":1001},{"$f":"IF(ROW(B2)-1>=$C$14,\"\",OFFSET(INDIRECT(MID(CELL(\"filename\",Sheet1!$A$15),FIND(\"]\",CELL(\"filename\",Sheet1!$A$15))+1,31)&\"!\"&ADDRESS(16,3,4)),ROW(B2)-1+SUM($B$14:$B$14),0))","v":1003},{"$f":"IF(ROW(B2)-1>=$D$14,\"\",OFFSET(INDIRECT(MID(CELL(\"filename\",Sheet1!$A$15),FIND(\"]\",CELL(\"filename\",Sheet1!$A$15))+1,31)&\"!\"&ADDRESS(16,3,4)),ROW(B2)-1+SUM($B$14:$C$14),0))","v":1005},{"$f":"IF(ROW(B2)-1>=$E$14,\"\",OFFSET(INDIRECT(MID(CELL(\"filename\",Sheet1!$A$15),FIND(\"]\",CELL(\"filename\",Sheet1!$A$15))+1,31)&\"!\"&ADDRESS(16,3,4)),ROW(B2)-1+SUM($B$14:$D$14),0))","v":1007},{"$f":"IF(SUM(B16:E16)>0,1,\"\")","v":1}]
[null,{"$f":"IF(ROW(B3)-1>=$B$14,\"\",OFFSET(INDIRECT(MID(CELL(\"filename\",Sheet1!$A$15),FIND(\"]\",CELL(\"filename\",Sheet1!$A$15))+1,31)&\"!\"&ADDRESS(16,3,4)),ROW(B3)-1,0))","v":2001},{"$f":"IF(ROW(B3)-1>=$C$14,\"\",OFFSET(INDIRECT(MID(CELL(\"filename\",Sheet1!$A$15),FIND(\"]\",CELL(\"filename\",Sheet1!$A$15))+1,31)&\"!\"&ADDRESS(16,3,4)),ROW(B3)-1+SUM($B$14:$B$14),0))","v":2003},{"$f":"IF(ROW(B3)-1>=$D$14,\"\",OFFSET(INDIRECT(MID(CELL(\"filename\",Sheet1!$A$15),FIND(\"]\",CELL(\"filename\",Sheet1!$A$15))+1,31)&\"!\"&ADDRESS(16,3,4)),ROW(B3)-1+SUM($B$14:$C$14),0))","v":2005},{"$f":"IF(ROW(B3)-1>=$E$14,\"\",OFFSET(INDIRECT(MID(CELL(\"filename\",Sheet1!$A$15),FIND(\"]\",CELL(\"filename\",Sheet1!$A$15))+1,31)&\"!\"&ADDRESS(16,3,4)),ROW(B3)-1+SUM($B$14:$D$14),0))","v":2007},1]
[null,{"$f":"IF(ROW(B4)-1>=$B$14,\"\",OFFSET(INDIRECT(MID(CELL(\"filename\",Sheet1!$A$15),FIND(\"]\",CELL(\"filename\",Sheet1!$A$15))+1,31)&\"!\"&ADDRESS(16,3,4)),ROW(B4)-1,0))","v":102},{"$f":"IF(ROW(B4)-1>=$C$14,\"\",OFFSET(INDIRECT(MID(CELL(\"filename\",Sheet1!$A$15),FIND(\"]\",CELL(\"filename\",Sheet1!$A$15))+1,31)&\"!\"&ADDRESS(16,3,4)),ROW(B4)-1+SUM($B$14:$B$14),0))","v":104},{"$f":"IF(ROW(B4)-1>=$D$14,\"\",OFFSET(INDIRECT(MID(CELL(\"filename\",Sheet1!$A$15),FIND(\"]\",CELL(\"filename\",Sheet1!$A$15))+1,31)&\"!\"&ADDRESS(16,3,4)),ROW(B4)-1+SUM($B$14:$C$14),0))","v":106},{"$f":"IF(ROW(B4)-1>=$E$14,\"\",OFFSET(INDIRECT(MID(CELL(\"filename\",Sheet1!$A$15),FIND(\"]\",CELL(\"filename\",Sheet1!$A$15))+1,31)&\"!\"&ADDRESS(16,3,4)),ROW(B4)-1+SUM($B$14:$D$14),0))","v":108},1]
[null,{"$f":"IF(ROW(B5)-1>=$B$14,\"\",OFFSET(INDIRECT(MID(CELL(\"filename\",Sheet1!$A$15),FIND(\"]\",CELL(\"filename\",Sheet1!$A$15))+1,31)&\"!\"&ADDRESS(16,3,4)),ROW(B5)-1,0))","v":1002},{"$f":"IF(ROW(B5)-1>=$C$14,\"\",OFFSET(INDIRECT(MID(CELL(\"filename\",Sheet1!$A$15),FIND(\"]\",CELL(\"filename\",Sheet1!$A$15))+1,31)&\"!\"&ADDRESS(16,3,4)),ROW(B5)-1+SUM($B$14:$B$14),0))","v":1004},{"$f":"IF(ROW(B5)-1>=$D$14,\"\",OFFSET(INDIRECT(MID(CELL(\"filename\",Sheet1!$A$15),FIND(\"]\",CELL(\"filename\",Sheet1!$A$15))+1,31)&\"!\"&ADDRESS(16,3,4)),ROW(B5)-1+SUM($B$14:$C$14),0))","v":1006},{"$f":"IF(ROW(B5)-1>=$E$14,\"\",OFFSET(INDIRECT(MID(CELL(\"filename\",Sheet1!$A$15),FIND(\"]\",CELL(\"filename\",Sheet1!$A$15))+1,31)&\"!\"&ADDRESS(16,3,4)),ROW(B5)-1+SUM($B$14:$D$14),0))","v":1008},1]
[null,{"$f":"IF(ROW(B6)-1>=$B$14,\"\",OFFSET(INDIRECT(MID(CELL(\"filename\",Sheet1!$A$15),FIND(\"]\",CELL(\"filename\",Sheet1!$A$15))+1,31)&\"!\"&ADDRESS(16,3,4)),ROW(B6)-1,0))","v":2002},{"$f":"IF(ROW(B6)-1>=$C$14,\"\",OFFSET(INDIRECT(MID(CELL(\"filename\",Sheet1!$A$15),FIND(\"]\",CELL(\"filename\",Sheet1!$A$15))+1,31)&\"!\"&ADDRESS(16,3,4)),ROW(B6)-1+SUM($B$14:$B$14),0))","v":2004},{"$f":"IF(ROW(B6)-1>=$D$14,\"\",OFFSET(INDIRECT(MID(CELL(\"filename\",Sheet1!$A$15),FIND(\"]\",CELL(\"filename\",Sheet1!$A$15))+1,31)&\"!\"&ADDRESS(16,3,4)),ROW(B6)-1+SUM($B$14:$C$14),0))","v":2006},{"$f":"IF(ROW(B6)-1>=$E$14,\"\",OFFSET(INDIRECT(MID(CELL(\"filename\",Sheet1!$A$15),FIND(\"]\",CELL(\"filename\",Sheet1!$A$15))+1,31)&\"!\"&ADDRESS(16,3,4)),ROW(B6)-1+SUM($B$14:$D$14),0))","v":2008},1]
[null,{"$f":"IF(ROW(B7)-1>=$B$14,\"\",OFFSET(INDIRECT(MID(CELL(\"filename\",Sheet1!$A$15),FIND(\"]\",CELL(\"filename\",Sheet1!$A$15))+1,31)&\"!\"&ADDRESS(16,3,4)),ROW(B7)-1,0))","v":""},{"$f":"IF(ROW(B7)-1>=$C$14,\"\",OFFSET(INDIRECT(MID(CELL(\"filename\",Sheet1!$A$15),FIND(\"]\",CELL(\"filename\",Sheet1!$A$15))+1,31)&\"!\"&ADDRESS(16,3,4)),ROW(B7)-1+SUM($B$14:$B$14),0))","v":""},{"$f":"IF(ROW(B7)-1>=$D$14,\"\",OFFSET(INDIRECT(MID(CELL(\"filename\",Sheet1!$A$15),FIND(\"]\",CELL(\"filename\",Sheet1!$A$15))+1,31)&\"!\"&ADDRESS(16,3,4)),ROW(B7)-1+SUM($B$14:$C$14),0))","v":""},{"$f":"IF(ROW(B7)-1>=$E$14,\"\",OFFSET(INDIRECT(MID(CELL(\"filename\",Sheet1!$A$15),FIND(\"]\",CELL(\"filename\",Sheet1!$A$15))+1,31)&\"!\"&ADDRESS(16,3,4)),ROW(B7)-1+SUM($B$14:$D$14),0))","v":""},""]
[null,{"$f":"IF(ROW(B8)-1>=$B$14,\"\",OFFSET(INDIRECT(MID(CELL(\"filename\",Sheet1!$A$15),FIND(\"]\",CELL(\"filename\",Sheet1!$A$15))+1,31)&\"!\"&ADDRESS(16,3,4)),ROW(B8)-1,0))","v":""},{"$f":"IF(ROW(B8)-1>=$C$14,\"\",OFFSET(INDIRECT(MID(CELL(\"filename\",Sheet1!$A$15),FIND(\"]\",CELL(\"filename\",Sheet1!$A$15))+1,31)&\"!\"&ADDRESS(16,3,4)),ROW(B8)-1+SUM($B$14:$B$14),0))","v":""},{"$f":"IF(ROW(B8)-1>=$D$14,\"\",OFFSET(INDIRECT(MID(CELL(\"filename\",Sheet1!$A$15),FIND(\"]\",CELL(\"filename\",Sheet1!$A$15))+1,31)&\"!\"&ADDRESS(16,3,4)),ROW(B8)-1+SUM($B$14:$C$14),0))","v":""},{"$f":"IF(ROW(B8)-1>=$E$14,\"\",OFFSET(INDIRECT(MID(CELL(\"filename\",Sheet1!$A$15),FIND(\"]\",CELL(\"filename\",Sheet1!$A$15))+1,31)&\"!\"&ADDRESS(16,3,4)),ROW(B8)-1+SUM($B$14:$D$14),0))","v":""},""]
[null,{"$f":"IF(ROW(B9)-1>=$B$14,\"\",OFFSET(INDIRECT(MID(CELL(\"filename\",Sheet1!$A$15),FIND(\"]\",CELL(\"filename\",Sheet1!$A$15))+1,31)&\"!\"&ADDRESS(16,3,4)),ROW(B9)-1,0))","v":""},{"$f":"IF(ROW(B9)-1>=$C$14,\"\",OFFSET(INDIRECT(MID(CELL(\"filename\",Sheet1!$A$15),FIND(\"]\",CELL(\"filename\",Sheet1!$A$15))+1,31)&\"!\"&ADDRESS(16,3,4)),ROW(B9)-1+SUM($B$14:$B$14),0))","v":""},{"$f":"IF(ROW(B9)-1>=$D$14,\"\",OFFSET(INDIRECT(MID(CELL(\"filename\",Sheet1!$A$15),FIND(\"]\",CELL(\"filename\",Sheet1!$A$15))+1,31)&\"!\"&ADDRESS(16,3,4)),ROW(B9)-1+SUM($B$14:$C$14),0))","v":""},{"$f":"IF(ROW(B9)-1>=$E$14,\"\",OFFSET(INDIRECT(MID(CELL(\"filename\",Sheet1!$A$15),FIND(\"]\",CELL(\"filename\",Sheet1!$A$15))+1,31)&\"!\"&ADDRESS(16,3,4)),ROW(B9)-1+SUM($B$14:$D$14),0))","v":""},""]
[null,{"$f":"IF(ROW(B10)-1>=$B$14,\"\",OFFSET(INDIRECT(MID(CELL(\"filename\",Sheet1!$A$15),FIND(\"]\",CELL(\"filename\",Sheet1!$A$15))+1,31)&\"!\"&ADDRESS(16,3,4)),ROW(B10)-1,0))","v":""},{"$f":"IF(ROW(B10)-1>=$C$14,\"\",OFFSET(INDIRECT(MID(CELL(\"filename\",Sheet1!$A$15),FIND(\"]\",CELL(\"filename\",Sheet1!$A$15))+1,31)&\"!\"&ADDRESS(16,3,4)),ROW(B10)-1+SUM($B$14:$B$14),0))","v":""},{"$f":"IF(ROW(B10)-1>=$D$14,\"\",OFFSET(INDIRECT(MID(CELL(\"filename\",Sheet1!$A$15),FIND(\"]\",CELL(\"filename\",Sheet1!$A$15))+1,31)&\"!\"&ADDRESS(16,3,4)),ROW(B10)-1+SUM($B$14:$C$14),0))","v":""},{"$f":"IF(ROW(B10)-1>=$E$14,\"\",OFFSET(INDIRECT(MID(CELL(\"filename\",Sheet1!$A$15),FIND(\"]\",CELL(\"filename\",Sheet1!$A$15))+1,31)&\"!\"&ADDRESS(16,3,4)),ROW(B10)-1+SUM($B$14:$D$14),0))","v":""},""]
[null,{"$f":"IF(ROW(B11)-1>=$B$14,\"\",OFFSET(INDIRECT(MID(CELL(\"filename\",Sheet1!$A$15),FIND(\"]\",CELL(\"filename\",Sheet1!$A$15))+1,31)&\"!\"&ADDRESS(16,3,4)),ROW(B11)-1,0))","v":""},{"$f":"IF(ROW(B11)-1>=$C$14,\"\",OFFSET(INDIRECT(MID(CELL(\"filename\",Sheet1!$A$15),FIND(\"]\",CELL(\"filename\",Sheet1!$A$15))+1,31)&\"!\"&ADDRESS(16,3,4)),ROW(B11)-1+SUM($B$14:$B$14),0))","v":""},{"$f":"IF(ROW(B11)-1>=$D$14,\"\",OFFSET(INDIRECT(MID(CELL(\"filename\",Sheet1!$A$15),FIND(\"]\",CELL(\"filename\",Sheet1!$A$15))+1,31)&\"!\"&ADDRESS(16,3,4)),ROW(B11)-1+SUM($B$14:$C$14),0))","v":""},{"$f":"IF(ROW(B11)-1>=$E$14,\"\",OFFSET(INDIRECT(MID(CELL(\"filename\",Sheet1!$A$15),FIND(\"]\",CELL(\"filename\",Sheet1!$A$15))+1,31)&\"!\"&ADDRESS(16,3,4)),ROW(B11)-1+SUM($B$14:$D$14),0))","v":""},""]
[null,{"$f":"IF(ROW(B12)-1>=$B$14,\"\",OFFSET(INDIRECT(MID(CELL(\"filename\",Sheet1!$A$15),FIND(\"]\",CELL(\"filename\",Sheet1!$A$15))+1,31)&\"!\"&ADDRESS(16,3,4)),ROW(B12)-1,0))","v":""},{"$f":"IF(ROW(B12)-1>=$C$14,\"\",OFFSET(INDIRECT(MID(CELL(\"filename\",Sheet1!$A$15),FIND(\"]\",CELL(\"filename\",Sheet1!$A$15))+1,31)&\"!\"&ADDRESS(16,3,4)),ROW(B12)-1+SUM($B$14:$B$14),0))","v":""},{"$f":"IF(ROW(B12)-1>=$D$14,\"\",OFFSET(INDIRECT(MID(CELL(\"filename\",Sheet1!$A$15),FIND(\"]\",CELL(\"filename\",Sheet1!$A$15))+1,31)&\"!\"&ADDRESS(16,3,4)),ROW(B12)-1+SUM($B$14:$C$14),0))","v":""},{"$f":"IF(ROW(B12)-1>=$E$14,\"\",OFFSET(INDIRECT(MID(CELL(\"filename\",Sheet1!$A$15),FIND(\"]\",CELL(\"filename\",Sheet1!$A$15))+1,31)&\"!\"&ADDRESS(16,3,4)),ROW(B12)-1+SUM($B$14:$D$14),0))","v":""},""]
[null,{"$f":"IF(ROW(B13)-1>=$B$14,\"\",OFFSET(INDIRECT(MID(CELL(\"filename\",Sheet1!$A$15),FIND(\"]\",CELL(\"filename\",Sheet1!$A$15))+1,31)&\"!\"&ADDRESS(16,3,4)),ROW(B13)-1,0))","v":""},{"$f":"IF(ROW(B13)-1>=$C$14,\"\",OFFSET(INDIRECT(MID(CELL(\"filename\",Sheet1!$A$15),FIND(\"]\",CELL(\"filename\",Sheet1!$A$15))+1,31)&\"!\"&ADDRESS(16,3,4)),ROW(B13)-1+SUM($B$14:$B$14),0))","v":""},{"$f":"IF(ROW(B13)-1>=$D$14,\"\",OFFSET(INDIRECT(MID(CELL(\"filename\",Sheet1!$A$15),FIND(\"]\",CELL(\"filename\",Sheet1!$A$15))+1,31)&\"!\"&ADDRESS(16,3,4)),ROW(B13)-1+SUM($B$14:$C$14),0))","v":""},{"$f":"IF(ROW(B13)-1>=$E$14,\"\",OFFSET(INDIRECT(MID(CELL(\"filename\",Sheet1!$A$15),FIND(\"]\",CELL(\"filename\",Sheet1!$A$15))+1,31)&\"!\"&ADDRESS(16,3,4)),ROW(B13)-1+SUM($B$14:$D$14),0))","v":""},""]
[null,{"$f":"IF(ROW(B14)-1>=$B$14,\"\",OFFSET(INDIRECT(MID(CELL(\"filename\",Sheet1!$A$15),FIND(\"]\",CELL(\"filename\",Sheet1!$A$15))+1,31)&\"!\"&ADDRESS(16,3,4)),ROW(B14)-1,0))","v":""},{"$f":"IF(ROW(B14)-1>=$C$14,\"\",OFFSET(INDIRECT(MID(CELL(\"filename\",Sheet1!$A$15),FIND(\"]\",CELL(\"filename\",Sheet1!$A$15))+1,31)&\"!\"&ADDRESS(16,3,4)),ROW(B14)-1+SUM($B$14:$B$14),0))","v":""},{"$f":"IF(ROW(B14)-1>=$D$14,\"\",OFFSET(INDIRECT(MID(CELL(\"filename\",Sheet1!$A$15),FIND(\"]\",CELL(\"filename\",Sheet1!$A$15))+1,31)&\"!\"&ADDRESS(16,3,4)),ROW(B14)-1+SUM($B$14:$C$14),0))","v":""},{"$f":"IF(ROW(B14)-1>=$E$14,\"\",OFFSET(INDIRECT(MID(CELL(\"filename\",Sheet1!$A$15),FIND(\"]\",CELL(\"filename\",Sheet1!$A$15))+1,31)&\"!\"&ADDRESS(16,3,4)),ROW(B14)-1+SUM($B$14:$D$14),0))","v":""},""]
[null,{"$f":"IF(ROW(B15)-1>=$B$14,\"\",OFFSET(INDIRECT(MID(CELL(\"filename\",Sheet1!$A$15),FIND(\"]\",CELL(\"filename\",Sheet1!$A$15))+1,31)&\"!\"&ADDRESS(16,3,4)),ROW(B15)-1,0))","v":""},{"$f":"IF(ROW(B15)-1>=$C$14,\"\",OFFSET(INDIRECT(MID(CELL(\"filename\",Sheet1!$A$15),FIND(\"]\",CELL(\"filename\",Sheet1!$A$15))+1,31)&\"!\"&ADDRESS(16,3,4)),ROW(B15)-1+SUM($B$14:$B$14),0))","v":""},{"$f":"IF(ROW(B15)-1>=$D$14,\"\",OFFSET(INDIRECT(MID(CELL(\"filename\",Sheet1!$A$15),FIND(\"]\",CELL(\"filename\",Sheet1!$A$15))+1,31)&\"!\"&ADDRESS(16,3,4)),ROW(B15)-1+SUM($B$14:$C$14),0))","v":""},{"$f":"IF(ROW(B15)-1>=$E$14,\"\",OFFSET(INDIRECT(MID(CELL(\"filename\",Sheet1!$A$15),FIND(\"]\",CELL(\"filename\",Sheet1!$A$15))+1,31)&\"!\"&ADDRESS(16,3,4)),ROW(B15)-1+SUM($B$14:$D$14),0))","v":""},""]
[null,{"$f":"IF(ROW(B16)-1>=$B$14,\"\",OFFSET(INDIRECT(MID(CELL(\"filename\",Sheet1!$A$15),FIND(\"]\",CELL(\"filename\",Sheet1!$A$15))+1,31)&\"!\"&ADDRESS(16,3,4)),ROW(B16)-1,0))","v":""},{"$f":"IF(ROW(B16)-1>=$C$14,\"\",OFFSET(INDIRECT(MID(CELL(\"filename\",Sheet1!$A$15),FIND(\"]\",CELL(\"filename\",Sheet1!$A$15))+1,31)&\"!\"&ADDRESS(16,3,4)),ROW(B16)-1+SUM($B$14:$B$14),0))","v":""},{"$f":"IF(ROW(B16)-1>=$D$14,\"\",OFFSET(INDIRECT(MID(CELL(\"filename\",Sheet1!$A$15),FIND(\"]\",CELL(\"filename\",Sheet1!$A$15))+1,31)&\"!\"&ADDRESS(16,3,4)),ROW(B16)-1+SUM($B$14:$C$14),0))","v":""},{"$f":"IF(ROW(B16)-1>=$E$14,\"\",OFFSET(INDIRECT(MID(CELL(\"filename\",Sheet1!$A$15),FIND(\"]\",CELL(\"filename\",Sheet1!$A$15))+1,31)&\"!\"&ADDRESS(16,3,4)),ROW(B16)-1+SUM($B$14:$D$14),0))","v":""},""]
[null,{"$f":"IF(ROW(B17)-1>=$B$14,\"\",OFFSET(INDIRECT(MID(CELL(\"filename\",Sheet1!$A$15),FIND(\"]\",CELL(\"filename\",Sheet1!$A$15))+1,31)&\"!\"&ADDRESS(16,3,4)),ROW(B17)-1,0))","v":""},{"$f":"IF(ROW(B17)-1>=$C$14,\"\",OFFSET(INDIRECT(MID(CELL(\"filename\",Sheet1!$A$15),FIND(\"]\",CELL(\"filename\",Sheet1!$A$15))+1,31)&\"!\"&ADDRESS(16,3,4)),ROW(B17)-1+SUM($B$14:$B$14),0))","v":""},{"$f":"IF(ROW(B17)-1>=$D$14,\"\",OFFSET(INDIRECT(MID(CELL(\"filename\",Sheet1!$A$15),FIND(\"]\",CELL(\"filename\",Sheet1!$A$15))+1,31)&\"!\"&ADDRESS(16,3,4)),ROW(B17)-1+SUM($B$14:$C$14),0))","v":""},{"$f":"IF(ROW(B17)-1>=$E$14,\"\",OFFSET(INDIRECT(MID(CELL(\"filename\",Sheet1!$A$15),FIND(\"]\",CELL(\"filename\",Sheet1!$A$15))+1,31)&\"!\"&ADDRESS(16,3,4)),ROW(B17)-1+SUM($B$14:$D$14),0))","v":""},""]
[null,{"$f":"IF(ROW(B18)-1>=$B$14,\"\",OFFSET(INDIRECT(MID(CELL(\"filename\",Sheet1!$A$15),FIND(\"]\",CELL(\"filename\",Sheet1!$A$15))+1,31)&\"!\"&ADDRESS(16,3,4)),ROW(B18)-1,0))","v":""},{"$f":"IF(ROW(B18)-1>=$C$14,\"\",OFFSET(INDIRECT(MID(CELL(\"filename\",Sheet1!$A$15),FIND(\"]\",CELL(\"filename\",Sheet1!$A$15))+1,31)&\"!\"&ADDRESS(16,3,4)),ROW(B18)-1+SUM($B$14:$B$14),0))","v":""},{"$f":"IF(ROW(B18)-1>=$D$14,\"\",OFFSET(INDIRECT(MID(CELL(\"filename\",Sheet1!$A$15),FIND(\"]\",CELL(\"filename\",Sheet1!$A$15))+1,31)&\"!\"&ADDRESS(16,3,4)),ROW(B18)-1+SUM($B$14:$C$14),0))","v":""},{"$f":"IF(ROW(B18)-1>=$E$14,\"\",OFFSET(INDIRECT(MID(CELL(\"filename\",Sheet1!$A$15),FIND(\"]\",CELL(\"filename\",Sheet1!$A$15))+1,31)&\"!\"&ADDRESS(16,3,4)),ROW(B18)-1+SUM($B$14:$D$14),0))","v":""},""]
[null,{"$f":"IF(ROW(B19)-1>=$B$14,\"\",OFFSET(INDIRECT(MID(CELL(\"filename\",Sheet1!$A$15),FIND(\"]\",CELL(\"filename\",Sheet1!$A$15))+1,31)&\"!\"&ADDRESS(16,3,4)),ROW(B19)-1,0))","v":""},{"$f":"IF(ROW(B19)-1>=$C$14,\"\",OFFSET(INDIRECT(MID(CELL(\"filename\",Sheet1!$A$15),FIND(\"]\",CELL(\"filename\",Sheet1!$A$15))+1,31)&\"!\"&ADDRESS(16,3,4)),ROW(B19)-1+SUM($B$14:$B$14),0))","v":""},{"$f":"IF(ROW(B19)-1>=$D$14,\"\",OFFSET(INDIRECT(MID(CELL(\"filename\",Sheet1!$A$15),FIND(\"]\",CELL(\"filename\",Sheet1!$A$15))+1,31)&\"!\"&ADDRESS(16,3,4)),ROW(B19)-1+SUM($B$14:$C$14),0))","v":""},{"$f":"IF(ROW(B19)-1>=$E$14,\"\",OFFSET(INDIRECT(MID(CELL(\"filename\",Sheet1!$A$15),FIND(\"]\",CELL(\"filename\",Sheet1!$A$15))+1,31)&\"!\"&ADDRESS(16,3,4)),ROW(B19)-1+SUM($B$14:$D$14),0))","v":""},""]
[null,{"$f":"IF(ROW(B20)-1>=$B$14,\"\",OFFSET(INDIRECT(MID(CELL(\"filename\",Sheet1!$A$15),FIND(\"]\",CELL(\"filename\",Sheet1!$A$15))+1,31)&\"!\"&ADDRESS(16,3,4)),ROW(B20)-1,0))","v":""},{"$f":"IF(ROW(B20)-1>=$C$14,\"\",OFFSET(INDIRECT(MID(CELL(\"filename\",Sheet1!$A$15),FIND(\"]\",CELL(\"filename\",Sheet1!$A$15))+1,31)&\"!\"&ADDRESS(16,3,4)),ROW(B20)-1+SUM($B$14:$B$14),0))","v":""},{"$f":"IF(ROW(B20)-1>=$D$14,\"\",OFFSET(INDIRECT(MID(CELL(\"filename\",Sheet1!$A$15),FIND(\"]\",CELL(\"filename\",Sheet1!$A$15))+1,31)&\"!\"&ADDRESS(16,3,4)),ROW(B20)-1+SUM($B$14:$C$14),0))","v":""},{"$f":"IF(ROW(B20)-1>=$E$14,\"\",OFFSET(INDIRECT(MID(CELL(\"filename\",Sheet1!$A$15),FIND(\"]\",CELL(\"filename\",Sheet1!$A$15))+1,31)&\"!\"&ADDRESS(16,3,4)),ROW(B20)-1+SUM($B$14:$D$14),0))","v":""},""]
[]
[null,"परीक्षा प्रभारी",null,null,"केन्द्राधीक्षक "]
[null,{"$f":"$J$6&\" (\"&$J$7&\")\"","v":"XYZ (Lecturer)"},null,null,{"$f":"$J$4&\" (\"&$J$5&\")\"","v":"XYZ (Principal)"}]

{"sheet":"Sheet3","index":2,"n_rows":37,"n_cols":6,"rows_kept":37,"merged":[[0,1,0,4],[1,1,1,4],[2,1,2,4],[3,1,3,4],[4,1,4,4],[5,1,5,4],[7,1,7,4],[8,1,8,2],[8,3,8,4],[9,1,9,4],[10,1,10,4],[11,1,11,4]]}
[null,{"$f":"Sheet2!$B$1","v":"Half Yearly Examination 2024"}]
[null,"परीक्षा केंद्र नाम एवं परीक्षा केंद्र क्रमांक"]
[null,{"$f":"Sheet2!$B$3","v":"Govt Sr Sc School Malutana (216405)"}]
[null,"परीक्षा कक्ष / हॉल क्रमांक"]
[null,{"$f":"Sheet2!$K$2","v":{"v":2,"d":"02"}}]
[null,"परीक्षा दिनांक (दिवस) ... से ... तक"]
[null,{"$f":"Sheet2!$B$7","v":"14-12-2024"},{"$f":"IF(B7=\"\",\"\",TEXT(B7,\"DDDD\"))","v":"Saturday"},{"$f":"Sheet2!$D$7","v":"24-12-2024"},{"$f":"IF(D7=\"\",\"\",TEXT(D7,\"DDDD\"))","v":"Tuesday"}]
[null,"परीक्षार्थी रोल नंबर ... से ... तक"]
[null,{"$f":"IF(B14>0,B15,IF(C14>0,C15,IF(D14>0,D15,IF(E14>0,E15,0))))","v":109},null,{"$f":"IF(E14>0,LOOKUP(2,1/(E15:E34<>\"\"),E15:E34),IF(D14>0,LOOKUP(2,1/(D15:D34<>\"\"),D15:D34),IF(C14>0,LOOKUP(2,1/(C15:C34<>\"\"),C15:C34),IF(B14>0,LOOKUP(2,1/(B15:B34<>\"\"),B15:B34),0))))","v":2016}]
[null,"कुल सम्मिलित परीक्षार्थी "]
[null,{"$f":"COUNTIF($B$15:$E$34,\">0\")","v":24}]
[null,"परीक्षार्थी बैठक व्यवस्था"]
[null,"पंक्ति 1","पंक्ति 2","पंक्ति 3","पंक्ति 4"]
[null,{"$f":"Sheet2!L2","v":6},{"$f":"Sheet2!M2","v":6},{"$f":"Sheet2!N2","v":5},{"$f":"Sheet2!O2","v":7}]
[null,{"$f":"IF(ROW(B1)-1>=$B$14,\"\",OFFSET(INDIRECT(MID(CELL(\"filename\",Sheet1!$A$15),FIND(\"]\",CELL(\"filename\",Sheet1!$A$15))+1,31)&\"!\"&ADDRESS(MATCH(Sheet2!$D$9,Sheet1!C:C,0)+1,3,4)),ROW(B1)-1,0))","v":109},{"$f":"IF(ROW(B1)-1>=$C$14,\"\",OFFSET(INDIRECT(MID(CELL(\"filename\",Sheet1!$A$15),FIND(\"]\",CELL(\"filename\",Sheet1!$A$15))+1,31)&\"!\"&ADDRESS(MATCH(Sheet2!$D$9,Sheet1!C:C,0)+1,3,4)),ROW(B1)-1+SUM($B$14:$B$14),0))","v":111},{"$f":"IF(ROW(B1)-1>=$D$14,\"\",OFFSET(INDIRECT(MID(CELL(\"filename\",Sheet1!$A$15),FIND(\"]\",CELL(\"filename\",Sheet1!$A$15))+1,31)&\"!\"&ADDRESS(MATCH(Sheet2!$D$9,Sheet1!C:C,0)+1,3,4)),ROW(B1)-1+SUM($B$14:$C$14),0))","v":113},{"$f":"IF(ROW(B1)-1>=$E$14,\"\",OFFSET(INDIRECT(MID(CELL(\"filename\",Sheet1!$A$15),FIND(\"]\",CELL(\"filename\",Sheet1!$A$15))+1,31)&\"!\"&ADDRESS(MATCH(Sheet2!$D$9,Sheet1!C:C,0)+1,3,4)),ROW(B1)-1+SUM($B$14:$D$14),0))","v":2014},{"$f":"IF(SUM(B15:E15)>0,1,\"\")","v":1}]
[null,{"$f":"IF(ROW(B2)-1>=$B$14,\"\",OFFSET(INDIRECT(MID(CELL(\"filename\",Sheet1!$A$15),FIND(\"]\",CELL(\"filename\",Sheet1!$A$15))+1,31)&\"!\"&ADDRESS(MATCH(Sheet2!$D$9,Sheet1!C:C,0)+1,3,4)),ROW(B2)-1,0))","v":1009},{"$f":"IF(ROW(B2)-1>=$C$14,\"\",OFFSET(INDIRECT(MID(CELL(\"filename\",Sheet1!$A$15),FIND(\"]\",CELL(\"filename\",Sheet1!$A$15))+1,31)&\"!\"&ADDRESS(MATCH(Sheet2!$D$9,Sheet1!C:C,0)+1,3,4)),ROW(B2)-1+SUM($B$14:$B$14),0))","v":1011},{"$f":"IF(ROW(B2)-1>=$D$14,\"\",OFFSET(INDIRECT(MID(CELL(\"filename\",Sheet1!$A$15),FIND(\"]\",CELL(\"filename\",Sheet1!$A$15))+1,31)&\"!\"&ADDRESS(MATCH(Sheet2!$D$9,Sheet1!C:C,0)+1,3,4)),ROW(B2)-1+SUM($B$14:$C$14),0))","v":1013},{"$f":"IF(ROW(B2)-1>=$E$14,\"\",OFFSET(INDIRECT(MID(CELL(\"filename\",Sheet1!$A$15),FIND(\"]\",CELL(\"filename\",Sheet1!$A$15))+1,31)&\"!\"&ADDRESS(MATCH(Sheet2!$D$9,Sheet1!C:C,0)+1,3,4)),ROW(B2)-1+SUM($B$14:$D$14),0))","v":115},{"$f":"IF(SUM(B16:E16)>0,1,\"\")","v":1}]
[null,{"$f":"IF(ROW(B3)-1>=$B$14,\"\",OFFSET(INDIRECT(MID(CELL(\"filename\",Sheet1!$A$15),FIND(\"]\",CELL(\"filename\",Sheet1!$A$15))+1,31)&\"!\"&ADDRESS(MATCH(Sheet2!$D$9,Sheet1!C:C,0)+1,3,4)),ROW(B3)-1,0))","v":2009},{"$f":"IF(ROW(B3)-1>=$C$14,\"\",OFFSET(INDIRECT(MID(CELL(\"filename\",Sheet1!$A$15),FIND(\"]\",CELL(\"filename\",Sheet1!$A$15))+1,31)&\"!\"&ADDRESS(MATCH(Sheet2!$D$9,Sheet1!C:C,0)+1,3,4)),ROW(B3)-1+SUM($B$14:$B$14),0))","v":2011},{"$f":"IF(ROW(B3)-1>=$D$14,\"\",OFFSET(INDIRECT(MID(CELL(\"filename\",Sheet1!$A$15),FIND(\"]\",CELL(\"filename\",Sheet1!$A$15))+1,31)&\"!\"&ADDRESS(MATCH(Sheet2!$D$9,Sheet1!C:C,0)+1,3,4)),ROW(B3)-1+SUM($B$14:$C$14),0))","v":2013},{"$f":"IF(ROW(B3)-1>=$E$14,\"\",OFFSET(INDIRECT(MID(CELL(\"filename\",Sheet1!$A$15),FIND(\"]\",CELL(\"filename\",Sheet1!$A$15))+1,31)&\"!\"&ADDRESS(MATCH(Sheet2!$D$9,Sheet1!C:C,0)+1,3,4)),ROW(B3)-1+SUM($B$14:$D$14),0))","v":1015},1]
[null,{"$f":"IF(ROW(B4)-1>=$B$14,\"\",OFFSET(INDIRECT(MID(CELL(\"filename\",Sheet1!$A$15),FIND(\"]\",CELL(\"filename\",Sheet1!$A$15))+1,31)&\"!\"&ADDRESS(MATCH(Sheet2!$D$9,Sheet1!C:C,0)+1,3,4)),ROW(B4)-1,0))","v":110},{"$f":"IF(ROW(B4)-1>=$C$14,\"\",OFFSET(INDIRECT(MID(CELL(\"filename\",Sheet1!$A$15),FIND(\"]\",CELL(\"filename\",Sheet1!$A$15))+1,31)&\"!\"&ADDRESS(MATCH(Sheet2!$D$9,Sheet1!C:C,0)+1,3,4)),ROW(B4)-1+SUM($B$14:$B$14),0))","v":112},{"$f":"IF(ROW(B4)-1>=$D$14,\"\",OFFSET(INDIRECT(MID(CELL(\"filename\",Sheet1!$A$15),FIND(\"]\",CELL(\"filename\",Sheet1!$A$15))+1,31)&\"!\"&ADDRESS(MATCH(Sheet2!$D$9,Sheet1!C:C,0)+1,3,4)),ROW(B4)-1+SUM($B$14:$C$14),0))","v":114},{"$f":"IF(ROW(B4)-1>=$E$14,\"\",OFFSET(INDIRECT(MID(CELL(\"filename\",Sheet1!$A$15),FIND(\"]\",CELL(\"filename\",Sheet1!$A$15))+1,31)&\"!\"&ADDRESS(MATCH(Sheet2!$D$9,Sheet1!C:C,0)+1,3,4)),ROW(B4)-1+SUM($B$14:$D$14),0))","v":2015},1]
[null,{"$f":"IF(ROW(B5)-1>=$B$14,\"\",OFFSET(INDIRECT(MID(CELL(\"filename\",Sheet1!$A$15),FIND(\"]\",CELL(\"filename\",Sheet1!$A$15))+1,31)&\"!\"&ADDRESS(MATCH(Sheet2!$D$9,Sheet1!C:C,0)+1,3,4)),ROW(B5)-1,0))","v":1010},{"$f":"IF(ROW(B5)-1>=$C$14,\"\",OFFSET(INDIRECT(MID(CELL(\"filename\",Sheet1!$A$15),FIND(\"]\",CELL(\"filename\",Sheet1!$A$15))+1,31)&\"!\"&ADDRESS(MATCH(Sheet2!$D$9,Sheet1!C:C,0)+1,3,4)),ROW(B5)-1+SUM($B$14:$B$14),0))","v":1012},{"$f":"IF(ROW(B5)-1>=$D$14,\"\",OFFSET(INDIRECT(MID(CELL(\"filename\",Sheet1!$A$15),FIND(\"]\",CELL(\"filename\",Sheet1!$A$15))+1,31)&\"!\"&ADDRESS(MATCH(Sheet2!$D$9,Sheet1!C:C,0)+1,3,4)),ROW(B5)-1+SUM($B$14:$C$14),0))","v":1014},{"$f":"IF(ROW(B5)-1>=$E$14,\"\",OFFSET(INDIRECT(MID(CELL(\"filename\",Sheet1!$A$15),FIND(\"]\",CELL(\"filename\",Sheet1!$A$15))+1,31)&\"!\"&ADDRESS(MATCH(Sheet2!$D$9,Sheet1!C:C,0)+1,3,4)),ROW(B5)-1+SUM($B$14:$D$14),0))","v":116},1]
[null,{"$f":"IF(ROW(B6)-1>=$B$14,\"\",OFFSET(INDIRECT(MID(CELL(\"filename\",Sheet1!$A$15),FIND(\"]\",CELL(\"filename\",Sheet1!$A$15))+1,31)&\"!\"&ADDRESS(MATCH(Sheet2!$D$9,Sheet1!C:C,0)+1,3,4)),ROW(B6)-1,0))","v":2010},{"$f":"IF(ROW(B6)-1>=$C$14,\"\",OFFSET(INDIRECT(MID(CELL(\"filename\",Sheet1!$A$15),FIND(\"]\",CELL(\"filename\",Sheet1!$A$15))+1,31)&\"!\"&ADDRESS(MATCH(Sheet2!$D$9,Sheet1!C:C,0)+1,3,4)),ROW(B6)-1+SUM($B$14:$B$14),0))","v":2012},{"$f":"IF(ROW(B6)-1>=$D$14,\"\",OFFSET(INDIRECT(MID(CELL(\"filename\",Sheet1!$A$15),FIND(\"]\",CELL(\"filename\",Sheet1!$A$15))+1,31)&\"!\"&ADDRESS(MATCH(Sheet2!$D$9,Sheet1!C:C,0)+1,3,4)),ROW(B6)-1+SUM($B$14:$C$14),0))","v":""},{"$f":"IF(ROW(B6)-1>=$E$14,\"\",OFFSET(INDIRECT(MID(CELL(\"filename\",Sheet1!$A$15),FIND(\"]\",CELL(\"filename\",Sheet1!$A$15))+1,31)&\"!\"&ADDRESS(MATCH(Sheet2!$D$9,Sheet1!C:C,0)+1,3,4)),ROW(B6)-1+SUM($B$14:$D$14),0))","v":1016},1]
[null,{"$f":"IF(ROW(B7)-1>=$B$14,\"\",OFFSET(INDIRECT(MID(CELL(\"filename\",Sheet1!$A$15),FIND(\"]\",CELL(\"filename\",Sheet1!$A$15))+1,31)&\"!\"&ADDRESS(MATCH(Sheet2!$D$9,Sheet1!C:C,0)+1,3,4)),ROW(B7)-1,0))","v":""},{"$f":"IF(ROW(B7)-1>=$C$14,\"\",OFFSET(INDIRECT(MID(CELL(\"filename\",Sheet1!$A$15),FIND(\"]\",CELL(\"filename\",Sheet1!$A$15))+1,31)&\"!\"&ADDRESS(MATCH(Sheet2!$D$9,Sheet1!C:C,0)+1,3,4)),ROW(B7)-1+SUM($B$14:$B$14),0))","v":""},{"$f":"IF(ROW(B7)-1>=$D$14,\"\",OFFSET(INDIRECT(MID(CELL(\"filename\",Sheet1!$A$15),FIND(\"]\",CELL(\"filename\",Sheet1!$A$15))+1,31)&\"!\"&ADDRESS(MATCH(Sheet2!$D$9,Sheet1!C:C,0)+1,3,4)),ROW(B7)-1+SUM($B$14:$C$14),0))","v":""},{"$f":"IF(ROW(B7)-1>=$E$14,\"\",OFFSET(INDIRECT(MID(CELL(\"filename\",Sheet1!$A$15),FIND(\"]\",CELL(\"filename\",Sheet1!$A$15))+1,31)&\"!\"&ADDRESS(MATCH(Sheet2!$D$9,Sheet1!C:C,0)+1,3,4)),ROW(B7)-1+SUM($B$14:$D$14),0))","v":2016},1]
[null,{"$f":"IF(ROW(B8)-1>=$B$14,\"\",OFFSET(INDIRECT(MID(CELL(\"filename\",Sheet1!$A$15),FIND(\"]\",CELL(\"filename\",Sheet1!$A$15))+1,31)&\"!\"&ADDRESS(MATCH(Sheet2!$D$9,Sheet1!C:C,0)+1,3,4)),ROW(B8)-1,0))","v":""},{"$f":"IF(ROW(B8)-1>=$C$14,\"\",OFFSET(INDIRECT(MID(CELL(\"filename\",Sheet1!$A$15),FIND(\"]\",CELL(\"filename\",Sheet1!$A$15))+1,31)&\"!\"&ADDRESS(MATCH(Sheet2!$D$9,Sheet1!C:C,0)+1,3,4)),ROW(B8)-1+SUM($B$14:$B$14),0))","v":""},{"$f":"IF(ROW(B8)-1>=$D$14,\"\",OFFSET(INDIRECT(MID(CELL(\"filename\",Sheet1!$A$15),FIND(\"]\",CELL(\"filename\",Sheet1!$A$15))+1,31)&\"!\"&ADDRESS(MATCH(Sheet2!$D$9,Sheet1!C:C,0)+1,3,4)),ROW(B8)-1+SUM($B$14:$C$14),0))","v":""},{"$f":"IF(ROW(B8)-1>=$E$14,\"\",OFFSET(INDIRECT(MID(CELL(\"filename\",Sheet1!$A$15),FIND(\"]\",CELL(\"filename\",Sheet1!$A$15))+1,31)&\"!\"&ADDRESS(MATCH(Sheet2!$D$9,Sheet1!C:C,0)+1,3,4)),ROW(B8)-1+SUM($B$14:$D$14),0))","v":""},""]
[null,{"$f":"IF(ROW(B9)-1>=$B$14,\"\",OFFSET(INDIRECT(MID(CELL(\"filename\",Sheet1!$A$15),FIND(\"]\",CELL(\"filename\",Sheet1!$A$15))+1,31)&\"!\"&ADDRESS(MATCH(Sheet2!$D$9,Sheet1!C:C,0)+1,3,4)),ROW(B9)-1,0))","v":""},{"$f":"IF(ROW(B9)-1>=$C$14,\"\",OFFSET(INDIRECT(MID(CELL(\"filename\",Sheet1!$A$15),FIND(\"]\",CELL(\"filename\",Sheet1!$A$15))+1,31)&\"!\"&ADDRESS(MATCH(Sheet2!$D$9,Sheet1!C:C,0)+1,3,4)),ROW(B9)-1+SUM($B$14:$B$14),0))","v":""},{"$f":"IF(ROW(B9)-1>=$D$14,\"\",OFFSET(INDIRECT(MID(CELL(\"filename\",Sheet1!$A$15),FIND(\"]\",CELL(\"filename\",Sheet1!$A$15))+1,31)&\"!\"&ADDRESS(MATCH(Sheet2!$D$9,Sheet1!C:C,0)+1,3,4)),ROW(B9)-1+SUM($B$14:$C$14),0))","v":""},{"$f":"IF(ROW(B9)-1>=$E$14,\"\",OFFSET(INDIRECT(MID(CELL(\"filename\",Sheet1!$A$15),FIND(\"]\",CELL(\"filename\",Sheet1!$A$15))+1,31)&\"!\"&ADDRESS(MATCH(Sheet2!$D$9,Sheet1!C:C,0)+1,3,4)),ROW(B9)-1+SUM($B$14:$D$14),0))","v":""},""]
[null,{"$f":"IF(ROW(B10)-1>=$B$14,\"\",OFFSET(INDIRECT(MID(CELL(\"filename\",Sheet1!$A$15),FIND(\"]\",CELL(\"filename\",Sheet1!$A$15))+1,31)&\"!\"&ADDRESS(MATCH(Sheet2!$D$9,Sheet1!C:C,0)+1,3,4)),ROW(B10)-1,0))","v":""},{"$f":"IF(ROW(B10)-1>=$C$14,\"\",OFFSET(INDIRECT(MID(CELL(\"filename\",Sheet1!$A$15),FIND(\"]\",CELL(\"filename\",Sheet1!$A$15))+1,31)&\"!\"&ADDRESS(MATCH(Sheet2!$D$9,Sheet1!C:C,0)+1,3,4)),ROW(B10)-1+SUM($B$14:$B$14),0))","v":""},{"$f":"IF(ROW(B10)-1>=$D$14,\"\",OFFSET(INDIRECT(MID(CELL(\"filename\",Sheet1!$A$15),FIND(\"]\",CELL(\"filename\",Sheet1!$A$15))+1,31)&\"!\"&ADDRESS(MATCH(Sheet2!$D$9,Sheet1!C:C,0)+1,3,4)),ROW(B10)-1+SUM($B$14:$C$14),0))","v":""},{"$f":"IF(ROW(B10)-1>=$E$14,\"\",OFFSET(INDIRECT(MID(CELL(\"filename\",Sheet1!$A$15),FIND(\"]\",CELL(\"filename\",Sheet1!$A$15))+1,31)&\"!\"&ADDRESS(MATCH(Sheet2!$D$9,Sheet1!C:C,0)+1,3,4)),ROW(B10)-1+SUM($B$14:$D$14),0))","v":""},""]
[null,{"$f":"IF(ROW(B11)-1>=$B$14,\"\",OFFSET(INDIRECT(MID(CELL(\"filename\",Sheet1!$A$15),FIND(\"]\",CELL(\"filename\",Sheet1!$A$15))+1,31)&\"!\"&ADDRESS(MATCH(Sheet2!$D$9,Sheet1!C:C,0)+1,3,4)),ROW(B11)-1,0))","v":""},{"$f":"IF(ROW(B11)-1>=$C$14,\"\",OFFSET(INDIRECT(MID(CELL(\"filename\",Sheet1!$A$15),FIND(\"]\",CELL(\"filename\",Sheet1!$A$15))+1,31)&\"!\"&ADDRESS(MATCH(Sheet2!$D$9,Sheet1!C:C,0)+1,3,4)),ROW(B11)-1+SUM($B$14:$B$14),0))","v":""},{"$f":"IF(ROW(B11)-1>=$D$14,\"\",OFFSET(INDIRECT(MID(CELL(\"filename\",Sheet1!$A$15),FIND(\"]\",CELL(\"filename\",Sheet1!$A$15))+1,31)&\"!\"&ADDRESS(MATCH(Sheet2!$D$9,Sheet1!C:C,0)+1,3,4)),ROW(B11)-1+SUM($B$14:$C$14),0))","v":""},{"$f":"IF(ROW(B11)-1>=$E$14,\"\",OFFSET(INDIRECT(MID(CELL(\"filename\",Sheet1!$A$15),FIND(\"]\",CELL(\"filename\",Sheet1!$A$15))+1,31)&\"!\"&ADDRESS(MATCH(Sheet2!$D$9,Sheet1!C:C,0)+1,3,4)),ROW(B11)-1+SUM($B$14:$D$14),0))","v":""},""]
[null,{"$f":"IF(ROW(B12)-1>=$B$14,\"\",OFFSET(INDIRECT(MID(CELL(\"filename\",Sheet1!$A$15),FIND(\"]\",CELL(\"filename\",Sheet1!$A$15))+1,31)&\"!\"&ADDRESS(MATCH(Sheet2!$D$9,Sheet1!C:C,0)+1,3,4)),ROW(B12)-1,0))","v":""},{"$f":"IF(ROW(B12)-1>=$C$14,\"\",OFFSET(INDIRECT(MID(CELL(\"filename\",Sheet1!$A$15),FIND(\"]\",CELL(\"filename\",Sheet1!$A$15))+1,31)&\"!\"&ADDRESS(MATCH(Sheet2!$D$9,Sheet1!C:C,0)+1,3,4)),ROW(B12)-1+SUM($B$14:$B$14),0))","v":""},{"$f":"IF(ROW(B12)-1>=$D$14,\"\",OFFSET(INDIRECT(MID(CELL(\"filename\",Sheet1!$A$15),FIND(\"]\",CELL(\"filename\",Sheet1!$A$15))+1,31)&\"!\"&ADDRESS(MATCH(Sheet2!$D$9,Sheet1!C:C,0)+1,3,4)),ROW(B12)-1+SUM($B$14:$C$14),0))","v":""},{"$f":"IF(ROW(B12)-1>=$E$14,\"\",OFFSET(INDIRECT(MID(CELL(\"filename\",Sheet1!$A$15),FIND(\"]\",CELL(\"filename\",Sheet1!$A$15))+1,31)&\"!\"&ADDRESS(MATCH(Sheet2!$D$9,Sheet1!C:C,0)+1,3,4)),ROW(B12)-1+SUM($B$14:$D$14),0))","v":""},""]
[null,{"$f":"IF(ROW(B13)-1>=$B$14,\"\",OFFSET(INDIRECT(MID(CELL(\"filename\",Sheet1!$A$15),FIND(\"]\",CELL(\"filename\",Sheet1!$A$15))+1,31)&\"!\"&ADDRESS(MATCH(Sheet2!$D$9,Sheet1!C:C,0)+1,3,4)),ROW(B13)-1,0))","v":""},{"$f":"IF(ROW(B13)-1>=$C$14,\"\",OFFSET(INDIRECT(MID(CELL(\"filename\",Sheet1!$A$15),FIND(\"]\",CELL(\"filename\",Sheet1!$A$15))+1,31)&\"!\"&ADDRESS(MATCH(Sheet2!$D$9,Sheet1!C:C,0)+1,3,4)),ROW(B13)-1+SUM($B$14:$B$14),0))","v":""},{"$f":"IF(ROW(B13)-1>=$D$14,\"\",OFFSET(INDIRECT(MID(CELL(\"filename\",Sheet1!$A$15),FIND(\"]\",CELL(\"filename\",Sheet1!$A$15))+1,31)&\"!\"&ADDRESS(MATCH(Sheet2!$D$9,Sheet1!C:C,0)+1,3,4)),ROW(B13)-1+SUM($B$14:$C$14),0))","v":""},{"$f":"IF(ROW(B13)-1>=$E$14,\"\",OFFSET(INDIRECT(MID(CELL(\"filename\",Sheet1!$A$15),FIND(\"]\",CELL(\"filename\",Sheet1!$A$15))+1,31)&\"!\"&ADDRESS(MATCH(Sheet2!$D$9,Sheet1!C:C,0)+1,3,4)),ROW(B13)-1+SUM($B$14:$D$14),0))","v":""},""]
[null,{"$f":"IF(ROW(B14)-1>=$B$14,\"\",OFFSET(INDIRECT(MID(CELL(\"filename\",Sheet1!$A$15),FIND(\"]\",CELL(\"filename\",Sheet1!$A$15))+1,31)&\"!\"&ADDRESS(MATCH(Sheet2!$D$9,Sheet1!C:C,0)+1,3,4)),ROW(B14)-1,0))","v":""},{"$f":"IF(ROW(B14)-1>=$C$14,\"\",OFFSET(INDIRECT(MID(CELL(\"filename\",Sheet1!$A$15),FIND(\"]\",CELL(\"filename\",Sheet1!$A$15))+1,31)&\"!\"&ADDRESS(MATCH(Sheet2!$D$9,Sheet1!C:C,0)+1,3,4)),ROW(B14)-1+SUM($B$14:$B$14),0))","v":""},{"$f":"IF(ROW(B14)-1>=$D$14,\"\",OFFSET(INDIRECT(MID(CELL(\"filename\",Sheet1!$A$15),FIND(\"]\",CELL(\"filename\",Sheet1!$A$15))+1,31)&\"!\"&ADDRESS(MATCH(Sheet2!$D$9,Sheet1!C:C,0)+1,3,4)),ROW(B14)-1+SUM($B$14:$C$14),0))","v":""},{"$f":"IF(ROW(B14)-1>=$E$14,\"\",OFFSET(INDIRECT(MID(CELL(\"filename\",Sheet1!$A$15),FIND(\"]\",CELL(\"filename\",Sheet1!$A$15))+1,31)&\"!\"&ADDRESS(MATCH(Sheet2!$D$9,Sheet1!C:C,0)+1,3,4)),ROW(B14)-1+SUM($B$14:$D$14),0))","v":""},""]
[null,{"$f":"IF(ROW(B15)-1>=$B$14,\"\",OFFSET(INDIRECT(MID(CELL(\"filename\",Sheet1!$A$15),FIND(\"]\",CELL(\"filename\",Sheet1!$A$15))+1,31)&\"!\"&ADDRESS(MATCH(Sheet2!$D$9,Sheet1!C:C,0)+1,3,4)),ROW(B15)-1,0))","v":""},{"$f":"IF(ROW(B15)-1>=$C$14,\"\",OFFSET(INDIRECT(MID(CELL(\"filename\",Sheet1!$A$15),FIND(\"]\",CELL(\"filename\",Sheet1!$A$15))+1,31)&\"!\"&ADDRESS(MATCH(Sheet2!$D$9,Sheet1!C:C,0)+1,3,4)),ROW(B15)-1+SUM($B$14:$B$14),0))","v":""},{"$f":"IF(ROW(B15)-1>=$D$14,\"\",OFFSET(INDIRECT(MID(CELL(\"filename\",Sheet1!$A$15),FIND(\"]\",CELL(\"filename\",Sheet1!$A$15))+1,31)&\"!\"&ADDRESS(MATCH(Sheet2!$D$9,Sheet1!C:C,0)+1,3,4)),ROW(B15)-1+SUM($B$14:$C$14),0))","v":""},{"$f":"IF(ROW(B15)-1>=$E$14,\"\",OFFSET(INDIRECT(MID(CELL(\"filename\",Sheet1!$A$15),FIND(\"]\",CELL(\"filename\",Sheet1!$A$15))+1,31)&\"!\"&ADDRESS(MATCH(Sheet2!$D$9,Sheet1!C:C,0)+1,3,4)),ROW(B15)-1+SUM($B$14:$D$14),0))","v":""},""]
[null,{"$f":"IF(ROW(B16)-1>=$B$14,\"\",OFFSET(INDIRECT(MID(CELL(\"filename\",Sheet1!$A$15),FIND(\"]\",CELL(\"filename\",Sheet1!$A$15))+1,31)&\"!\"&ADDRESS(MATCH(Sheet2!$D$9,Sheet1!C:C,0)+1,3,4)),ROW(B16)-1,0))","v":""},{"$f":"IF(ROW(B16)-1>=$C$14,\"\",OFFSET(INDIRECT(MID(CELL(\"filename\",Sheet1!$A$15),FIND(\"]\",CELL(\"filename\",Sheet1!$A$15))+1,31)&\"!\"&ADDRESS(MATCH(Sheet2!$D$9,Sheet1!C:C,0)+1,3,4)),ROW(B16)-1+SUM($B$14:$B$14),0))","v":""},{"$f":"IF(ROW(B16)-1>=$D$14,\"\",OFFSET(INDIRECT(MID(CELL(\"filename\",Sheet1!$A$15),FIND(\"]\",CELL(\"filename\",Sheet1!$A$15))+1,31)&\"!\"&ADDRESS(MATCH(Sheet2!$D$9,Sheet1!C:C,0)+1,3,4)),ROW(B16)-1+SUM($B$14:$C$14),0))","v":""},{"$f":"IF(ROW(B16)-1>=$E$14,\"\",OFFSET(INDIRECT(MID(CELL(\"filename\",Sheet1!$A$15),FIND(\"]\",CELL(\"filename\",Sheet1!$A$15))+1,31)&\"!\"&ADDRESS(MATCH(Sheet2!$D$9,Sheet1!C:C,0)+1,3,4)),ROW(B16)-1+SUM($B$14:$D$14),0))","v":""},""]
[null,{"$f":"IF(ROW(B17)-1>=$B$14,\"\",OFFSET(INDIRECT(MID(CELL(\"filename\",Sheet1!$A$15),FIND(\"]\",CELL(\"filename\",Sheet1!$A$15))+1,31)&\"!\"&ADDRESS(MATCH(Sheet2!$D$9,Sheet1!C:C,0)+1,3,4)),ROW(B17)-1,0))","v":""},{"$f":"IF(ROW(B17)-1>=$C$14,\"\",OFFSET(INDIRECT(MID(CELL(\"filename\",Sheet1!$A$15),FIND(\"]\",CELL(\"filename\",Sheet1!$A$15))+1,31)&\"!\"&ADDRESS(MATCH(Sheet2!$D$9,Sheet1!C:C,0)+1,3,4)),ROW(B17)-1+SUM($B$14:$B$14),0))","v":""},{"$f":"IF(ROW(B17)-1>=$D$14,\"\",OFFSET(INDIRECT(MID(CELL(\"filename\",Sheet1!$A$15),FIND(\"]\",CELL(\"filename\",Sheet1!$A$15))+1,31)&\"!\"&ADDRESS(MATCH(Sheet2!$D$9,Sheet1!C:C,0)+1,3,4)),ROW(B17)-1+SUM($B$14:$C$14),0))","v":""},{"$f":"IF(ROW(B17)-1>=$E$14,\"\",OFFSET(INDIRECT(MID(CELL(\"filename\",Sheet1!$A$15),FIND(\"]\",CELL(\"filename\",Sheet1!$A$15))+1,31)&\"!\"&ADDRESS(MATCH(Sheet2!$D$9,Sheet1!C:C,0)+1,3,4)),ROW(B17)-1+SUM($B$14:$D$14),0))","v":""},""]
[null,{"$f":"IF(ROW(B18)-1>=$B$14,\"\",OFFSET(INDIRECT(MID(CELL(\"filename\",Sheet1!$A$15),FIND(\"]\",CELL(\"filename\",Sheet1!$A$15))+1,31)&\"!\"&ADDRESS(MATCH(Sheet2!$D$9,Sheet1!C:C,0)+1,3,4)),ROW(B18)-1,0))","v":""},{"$f":"IF(ROW(B18)-1>=$C$14,\"\",OFFSET(INDIRECT(MID(CELL(\"filename\",Sheet1!$A$15),FIND(\"]\",CELL(\"filename\",Sheet1!$A$15))+1,31)&\"!\"&ADDRESS(MATCH(Sheet2!$D$9,Sheet1!C:C,0)+1,3,4)),ROW(B18)-1+SUM($B$14:$B$14),0))","v":""},{"$f":"IF(ROW(B18)-1>=$D$14,\"\",OFFSET(INDIRECT(MID(CELL(\"filename\",Sheet1!$A$15),FIND(\"]\",CELL(\"filename\",Sheet1!$A$15))+1,31)&\"!\"&ADDRESS(MATCH(Sheet2!$D$9,Sheet1!C:C,0)+1,3,4)),ROW(B18)-1+SUM($B$14:$C$14),0))","v":""},{"$f":"IF(ROW(B18)-1>=$E$14,\"\",OFFSET(INDIRECT(MID(CELL(\"filename\",Sheet1!$A$15),FIND(\"]\",CELL(\"filename\",Sheet1!$A$15))+1,31)&\"!\"&ADDRESS(MATCH(Sheet2!$D$9,Sheet1!C:C,0)+1,3,4)),ROW(B18)-1+SUM($B$14:$D$14),0))","v":""},""]
[null,{"$f":"IF(ROW(B19)-1>=$B$14,\"\",OFFSET(INDIRECT(MID(CELL(\"filename\",Sheet1!$A$15),FIND(\"]\",CELL(\"filename\",Sheet1!$A$15))+1,31)&\"!\"&ADDRESS(MATCH(Sheet2!$D$9,Sheet1!C:C,0)+1,3,4)),ROW(B19)-1,0))","v":""},{"$f":"IF(ROW(B19)-1>=$C$14,\"\",OFFSET(INDIRECT(MID(CELL(\"filename\",Sheet1!$A$15),FIND(\"]\",CELL(\"filename\",Sheet1!$A$15))+1,31)&\"!\"&ADDRESS(MATCH(Sheet2!$D$9,Sheet1!C:C,0)+1,3,4)),ROW(B19)-1+SUM($B$14:$B$14),0))","v":""},{"$f":"IF(ROW(B19)-1>=$D$14,\"\",OFFSET(INDIRECT(MID(CELL(\"filename\",Sheet1!$A$15),FIND(\"]\",CELL(\"filename\",Sheet1!$A$15))+1,31)&\"!\"&ADDRESS(MATCH(Sheet2!$D$9,Sheet1!C:C,0)+1,3,4)),ROW(B19)-1+SUM($B$14:$C$14),0))","v":""},{"$f":"IF(ROW(B19)-1>=$E$14,\"\",OFFSET(INDIRECT(MID(CELL(\"filename\",Sheet1!$A$15),FIND(\"]\",CELL(\"filename\",Sheet1!$A$15))+1,31)&\"!\"&ADDRESS(MATCH(Sheet2!$D$9,Sheet1!C:C,0)+1,3,4)),ROW(B19)-1+SUM($B$14:$D$14),0))","v":""},""]
[null,{"$f":"IF(ROW(B20)-1>=$B$14,\"\",OFFSET(INDIRECT(MID(CELL(\"filename\",Sheet1!$A$15),FIND(\"]\",CELL(\"filename\",Sheet1!$A$15))+1,31)&\"!\"&ADDRESS(MATCH(Sheet2!$D$9,Sheet1!C:C,0)+1,3,4)),ROW(B20)-1,0))","v":""},{"$f":"IF(ROW(B20)-1>=$C$14,\"\",OFFSET(INDIRECT(MID(CELL(\"filename\",Sheet1!$A$15),FIND(\"]\",CELL(\"filename\",Sheet1!$A$15))+1,31)&\"!\"&ADDRESS(MATCH(Sheet2!$D$9,Sheet1!C:C,0)+1,3,4)),ROW(B20)-1+SUM($B$14:$B$14),0))","v":""},{"$f":"IF(ROW(B20)-1>=$D$14,\"\",OFFSET(INDIRECT(MID(CELL(\"filename\",Sheet1!$A$15),FIND(\"]\",CELL(\"filename\",Sheet1!$A$15))+1,31)&\"!\"&ADDRESS(MATCH(Sheet2!$D$9,Sheet1!C:C,0)+1,3,4)),ROW(B20)-1+SUM($B$14:$C$14),0))","v":""},{"$f":"IF(ROW(B20)-1>=$E$14,\"\",OFFSET(INDIRECT(MID(CELL(\"filename\",Sheet1!$A$15),FIND(\"]\",CELL(\"filename\",Sheet1!$A$15))+1,31)&\"!\"&ADDRESS(MATCH(Sheet2!$D$9,Sheet1!C:C,0)+1,3,4)),ROW(B20)-1+SUM($B$14:$D$14),0))","v":""},""]
[]
[null,"परीक्षा प्रभारी",null,null,"केन्द्राधीक्षक "]
[null,{"$f":"Sheet2!$B$37","v":"XYZ (Lecturer)"},null,null,{"$f":"Sheet2!$E$37","v":"XYZ (Principal)"}]

{"sheet":"Sheet4","index":3,"n_rows":37,"n_cols":6,"rows_kept":37,"merged":[[0,1,0,4],[1,1,1,4],[2,1,2,4],[3,1,3,4],[4,1,4,4],[5,1,5,4],[7,1,7,4],[8,1,8,2],[8,3,8,4],[9,1,9,4],[10,1,10,4],[11,1,11,4]]}
[null,{"$f":"Sheet2!$B$1","v":"Half Yearly Examination 2024"}]
[null,"परीक्षा केंद्र नाम एवं परीक्षा केंद्र क्रमांक"]
[null,{"$f":"Sheet2!$B$3","v":"Govt Sr Sc School Malutana (216405)"}]
[null,"परीक्षा कक्ष / हॉल क्रमांक"]
[null,{"$f":"Sheet2!$K$3","v":{"v":3,"d":"03"}}]
[null,"परीक्षा दिनांक (दिवस) ... से ... तक"]
[null,{"$f":"Sheet2!$B$7","v":"14-12-2024"},{"$f":"IF(B7=\"\",\"\",TEXT(B7,\"DDDD\"))","v":"Saturday"},{"$f":"Sheet2!$D$7","v":"24-12-2024"},{"$f":"IF(D7=\"\",\"\",TEXT(D7,\"DDDD\"))","v":"Tuesday"}]
[null,"परीक्षार्थी रोल नंबर ... से ... तक"]
[null,{"$f":"IF(B14>0,B15,IF(C14>0,C15,IF(D14>0,D15,IF(E14>0,E15,0))))","v":117},null,{"$f":"IF(E14>0,LOOKUP(2,1/(E15:E34<>\"\"),E15:E34),IF(D14>0,LOOKUP(2,1/(D15:D34<>\"\"),D15:D34),IF(C14>0,LOOKUP(2,1/(C15:C34<>\"\"),C15:C34),IF(B14>0,LOOKUP(2,1/(B15:B34<>\"\"),B15:B34),0))))","v":1024}]
[null,"कुल सम्मिलित परीक्षार्थी "]
[null,{"$f":"COUNTIF($B$15:$E$34,\">0\")","v":23}]
[null,"परीक्षार्थी बैठक व्यवस्था"]
[null,"पंक्ति 1","पंक्ति 2","पंक्ति 3","पंक्ति 4"]
[null,{"$f":"Sheet2!L3","v":5},{"$f":"Sheet2!M3","v":5},{"$f":"Sheet2!N3","v":5},{"$f":"Sheet2!O3","v":8}]
[null,{"$f":"IF(ROW(B1)-1>=$B$14,\"\",OFFSET(INDIRECT(MID(CELL(\"filename\",Sheet1!$A$15),FIND(\"]\",CELL(\"filename\",Sheet1!$A$15))+1,31)&\"!\"&ADDRESS(MATCH(Sheet3!$D$9,Sheet1!C:C,0)+1,3,4)),ROW(B1)-1,0))","v":117},{"$f":"IF(ROW(B1)-1>=$C$14,\"\",OFFSET(INDIRECT(MID(CELL(\"filename\",Sheet1!$A$15),FIND(\"]\",CELL(\"filename\",Sheet1!$A$15))+1,31)&\"!\"&ADDRESS(MATCH(Sheet3!$D$9,Sheet1!C:C,0)+1,3,4)),ROW(B1)-1+SUM($B$14:$B$14),0))","v":2018},{"$f":"IF(ROW(B1)-1>=$D$14,\"\",OFFSET(INDIRECT(MID(CELL(\"filename\",Sheet1!$A$15),FIND(\"]\",CELL(\"filename\",Sheet1!$A$15))+1,31)&\"!\"&ADDRESS(MATCH(Sheet3!$D$9,Sheet1!C:C,0)+1,3,4)),ROW(B1)-1+SUM($B$14:$C$14),0))","v":1020},{"$f":"IF(ROW(B1)-1>=$E$14,\"\",OFFSET(INDIRECT(MID(CELL(\"filename\",Sheet1!$A$15),FIND(\"]\",CELL(\"filename\",Sheet1!$A$15))+1,31)&\"!\"&ADDRESS(MATCH(Sheet3!$D$9,Sheet1!C:C,0)+1,3,4)),ROW(B1)-1+SUM($B$14:$D$14),0))","v":122},{"$f":"IF(SUM(B15:E15)>0,1,\"\")","v":1}]
[null,{"$f":"IF(ROW(B2)-1>=$B$14,\"\",OFFSET(INDIRECT(MID(CELL(\"filename\",Sheet1!$A$15),FIND(\"]\",CELL(\"filename\",Sheet1!$A$15))+1,31)&\"!\"&ADDRESS(MATCH(Sheet3!$D$9,Sheet1!C:C,0)+1,3,4)),ROW(B2)-1,0))","v":1017},{"$f":"IF(ROW(B2)-1>=$C$14,\"\",OFFSET(INDIRECT(MID(CELL(\"filename\",Sheet1!$A$15),FIND(\"]\",CELL(\"filename\",Sheet1!$A$15))+1,31)&\"!\"&ADDRESS(MATCH(Sheet3!$D$9,Sheet1!C:C,0)+1,3,4)),ROW(B2)-1+SUM($B$14:$B$14),0))","v":119},{"$f":"IF(ROW(B2)-1>=$D$14,\"\",OFFSET(INDIRECT(MID(CELL(\"filename\",Sheet1!$A$15),FIND(\"]\",CELL(\"filename\",Sheet1!$A$15))+1,31)&\"!\"&ADDRESS(MATCH(Sheet3!$D$9,Sheet1!C:C,0)+1,3,4)),ROW(B2)-1+SUM($B$14:$C$14),0))","v":2020},{"$f":"IF(ROW(B2)-1>=$E$14,\"\",OFFSET(INDIRECT(MID(CELL(\"filename\",Sheet1!$A$15),FIND(\"]\",CELL(\"filename\",Sheet1!$A$15))+1,31)&\"!\"&ADDRESS(MATCH(Sheet3!$D$9,Sheet1!C:C,0)+1,3,4)),ROW(B2)-1+SUM($B$14:$D$14),0))","v":1022},{"$f":"IF(SUM(B16:E16)>0,1,\"\")","v":1}]
[null,{"$f":"IF(ROW(B3)-1>=$B$14,\"\",OFFSET(INDIRECT(MID(CELL(\"filename\",Sheet1!$A$15),FIND(\"]\",CELL(\"filename\",Sheet1!$A$15))+1,31)&\"!\"&ADDRESS(MATCH(Sheet3!$D$9,Sheet1!C:C,0)+1,3,4)),ROW(B3)-1,0))","v":2017},{"$f":"IF(ROW(B3)-1>=$C$14,\"\",OFFSET(INDIRECT(MID(CELL(\"filename\",Sheet1!$A$15),FIND(\"]\",CELL(\"filename\",Sheet1!$A$15))+1,31)&\"!\"&ADDRESS(MATCH(Sheet3!$D$9,Sheet1!C:C,0)+1,3,4)),ROW(B3)-1+SUM($B$14:$B$14),0))","v":1019},{"$f":"IF(ROW(B3)-1>=$D$14,\"\",OFFSET(INDIRECT(MID(CELL(\"filename\",Sheet1!$A$15),FIND(\"]\",CELL(\"filename\",Sheet1!$A$15))+1,31)&\"!\"&ADDRESS(MATCH(Sheet3!$D$9,Sheet1!C:C,0)+1,3,4)),ROW(B3)-1+SUM($B$14:$C$14),0))","v":121},{"$f":"IF(ROW(B3)-1>=$E$14,\"\",OFFSET(INDIRECT(MID(CELL(\"filename\",Sheet1!$A$15),FIND(\"]\",CELL(\"filename\",Sheet1!$A$15))+1,31)&\"!\"&ADDRESS(MATCH(Sheet3!$D$9,Sheet1!C:C,0)+1,3,4)),ROW(B3)-1+SUM($B$14:$D$14),0))","v":2022},1]
[null,{"$f":"IF(ROW(B4)-1>=$B$14,\"\",OFFSET(INDIRECT(MID(CELL(\"filename\",Sheet1!$A$15),FIND(\"]\",CELL(\"filename\",Sheet1!$A$15))+1,31)&\"!\"&ADDRESS(MATCH(Sheet3!$D$9,Sheet1!C:C,0)+1,3,4)),ROW(B4)-1,0))","v":118},{"$f":"IF(ROW(B4)-1>=$C$14,\"\",OFFSET(INDIRECT(MID(CELL(\"filename\",Sheet1!$A$15),FIND(\"]\",CELL(\"filename\",Sheet1!$A$15))+1,31)&\"!\"&ADDRESS(MATCH(Sheet3!$D$9,Sheet1!C:C,0)+1,3,4)),ROW(B4)-1+SUM($B$14:$B$14),0))","v":2019},{"$f":"IF(ROW(B4)-1>=$D$14,\"\",OFFSET(INDIRECT(MID(CELL(\"filename\",Sheet1!$A$15),FIND(\"]\",CELL(\"filename\",Sheet1!$A$15))+1,31)&\"!\"&ADDRESS(MATCH(Sheet3!$D$9,Sheet1!C:C,0)+1,3,4)),ROW(B4)-1+SUM($B$14:$C$14),0))","v":1021},{"$f":"IF(ROW(B4)-1>=$E$14,\"\",OFFSET(INDIRECT(MID(CELL(\"filename\",Sheet1!$A$15),FIND(\"]\",CELL(\"filename\",Sheet1!$A$15))+1,31)&\"!\"&ADDRESS(MATCH(Sheet3!$D$9,Sheet1!C:C,0)+1,3,4)),ROW(B4)-1+SUM($B$14:$D$14),0))","v":123},1]
[null,{"$f":"IF(ROW(B5)-1>=$B$14,\"\",OFFSET(INDIRECT(MID(CELL(\"filename\",Sheet1!$A$15),FIND(\"]\",CELL(\"filename\",Sheet1!$A$15))+1,31)&\"!\"&ADDRESS(MATCH(Sheet3!$D$9,Sheet1!C:C,0)+1,3,4)),ROW(B5)-1,0))","v":1018},{"$f":"IF(ROW(B5)-1>=$C$14,\"\",OFFSET(INDIRECT(MID(CELL(\"filename\",Sheet1!$A$15),FIND(\"]\",CELL(\"filename\",Sheet1!$A$15))+1,31)&\"!\"&ADDRESS(MATCH(Sheet3!$D$9,Sheet1!C:C,0)+1,3,4)),ROW(B5)-1+SUM($B$14:$B$14),0))","v":120},{"$f":"IF(ROW(B5)-1>=$D$14,\"\",OFFSET(INDIRECT(MID(CELL(\"filename\",Sheet1!$A$15),FIND(\"]\",CELL(\"filename\",Sheet1!$A$15))+1,31)&\"!\"&ADDRESS(MATCH(Sheet3!$D$9,Sheet1!C:C,0)+1,3,4)),ROW(B5)-1+SUM($B$14:$C$14),0))","v":2021},{"$f":"IF(ROW(B5)-1>=$E$14,\"\",OFFSET(INDIRECT(MID(CELL(\"filename\",Sheet1!$A$15),FIND(\"]\",CELL(\"filename\",Sheet1!$A$15))+1,31)&\"!\"&ADDRESS(MATCH(Sheet3!$D$9,Sheet1!C:C,0)+1,3,4)),ROW(B5)-1+SUM($B$14:$D$14),0))","v":1023},1]
[null,{"$f":"IF(ROW(B6)-1>=$B$14,\"\",OFFSET(INDIRECT(MID(CELL(\"filename\",Sheet1!$A$15),FIND(\"]\",CELL(\"filename\",Sheet1!$A$15))+1,31)&\"!\"&ADDRESS(MATCH(Sheet3!$D$9,Sheet1!C:C,0)+1,3,4)),ROW(B6)-1,0))","v":""},{"$f":"IF(ROW(B6)-1>=$C$14,\"\",OFFSET(INDIRECT(MID(CELL(\"filename\",Sheet1!$A$15),FIND(\"]\",CELL(\"filename\",Sheet1!$A$15))+1,31)&\"!\"&ADDRESS(MATCH(Sheet3!$D$9,Sheet1!C:C,0)+1,3,4)),ROW(B6)-1+SUM($B$14:$B$14),0))","v":""},{"$f":"IF(ROW(B6)-1>=$D$14,\"\",OFFSET(INDIRECT(MID(CELL(\"filename\",Sheet1!$A$15),FIND(\"]\",CELL(\"filename\",Sheet1!$A$15))+1,31)&\"!\"&ADDRESS(MATCH(Sheet3!$D$9,Sheet1!C:C,0)+1,3,4)),ROW(B6)-1+SUM($B$14:$C$14),0))","v":""},{"$f":"IF(ROW(B6)-1>=$E$14,\"\",OFFSET(INDIRECT(MID(CELL(\"filename\",Sheet1!$A$15),FIND(\"]\",CELL(\"filename\",Sheet1!$A$15))+1,31)&\"!\"&ADDRESS(MATCH(Sheet3!$D$9,Sheet1!C:C,0)+1,3,4)),ROW(B6)-1+SUM($B$14:$D$14),0))","v":2023},1]
[null,{"$f":"IF(ROW(B7)-1>=$B$14,\"\",OFFSET(INDIRECT(MID(CELL(\"filename\",Sheet1!$A$15),FIND(\"]\",CELL(\"filename\",Sheet1!$A$15))+1,31)&\"!\"&ADDRESS(MATCH(Sheet3!$D$9,Sheet1!C:C,0)+1,3,4)),ROW(B7)-1,0))","v":""},{"$f":"IF(ROW(B7)-1>=$C$14,\"\",OFFSET(INDIRECT(MID(CELL(\"filename\",Sheet1!$A$15),FIND(\"]\",CELL(\"filename\",Sheet1!$A$15))+1,31)&\"!\"&ADDRESS(MATCH(Sheet3!$D$9,Sheet1!C:C,0)+1,3,4)),ROW(B7)-1+SUM($B$14:$B$14),0))","v":""},{"$f":"IF(ROW(B7)-1>=$D$14,\"\",OFFSET(INDIRECT(MID(CELL(\"filename\",Sheet1!$A$15),FIND(\"]\",CELL(\"filename\",Sheet1!$A$15))+1,31)&\"!\"&ADDRESS(MATCH(Sheet3!$D$9,Sheet1!C:C,0)+1,3,4)),ROW(B7)-1+SUM($B$14:$C$14),0))","v":""},{"$f":"IF(ROW(B7)-1>=$E$14,\"\",OFFSET(INDIRECT(MID(CELL(\"filename\",Sheet1!$A$15),FIND(\"]\",CELL(\"filename\",Sheet1!$A$15))+1,31)&\"!\"&ADDRESS(MATCH(Sheet3!$D$9,Sheet1!C:C,0)+1,3,4)),ROW(B7)-1+SUM($B$14:$D$14),0))","v":124},1]
[null,{"$f":"IF(ROW(B8)-1>=$B$14,\"\",OFFSET(INDIRECT(MID(CELL(\"filename\",Sheet1!$A$15),FIND(\"]\",CELL(\"filename\",Sheet1!$A$15))+1,31)&\"!\"&ADDRESS(MATCH(Sheet3!$D$9,Sheet1!C:C,0)+1,3,4)),ROW(B8)-1,0))","v":""},{"$f":"IF(ROW(B8)-1>=$C$14,\"\",OFFSET(INDIRECT(MID(CELL(\"filename\",Sheet1!$A$15),FIND(\"]\",CELL(\"filename\",Sheet1!$A$15))+1,31)&\"!\"&ADDRESS(MATCH(Sheet3!$D$9,Sheet1!C:C,0)+1,3,4)),ROW(B8)-1+SUM($B$14:$B$14),0))","v":""},{"$f":"IF(ROW(B8)-1>=$D$14,\"\",OFFSET(INDIRECT(MID(CELL(\"filename\",Sheet1!$A$15),FIND(\"]\",CELL(\"filename\",Sheet1!$A$15))+1,31)&\"!\"&ADDRESS(MATCH(Sheet3!$D$9,Sheet1!C:C,0)+1,3,4)),ROW(B8)-1+SUM($B$14:$C$14),0))","v":""},{"$f":"IF(ROW(B8)-1>=$E$14,\"\",OFFSET(INDIRECT(MID(CELL(\"filename\",Sheet1!$A$15),FIND(\"]\",CELL(\"filename\",Sheet1!$A$15))+1,31)&\"!\"&ADDRESS(MATCH(Sheet3!$D$9,Sheet1!C:C,0)+1,3,4)),ROW(B8)-1+SUM($B$14:$D$14),0))","v":1024},1]
[null,{"$f":"IF(ROW(B9)-1>=$B$14,\"\",OFFSET(INDIRECT(MID(CELL(\"filename\",Sheet1!$A$15),FIND(\"]\",CELL(\"filename\",Sheet1!$A$15))+1,31)&\"!\"&ADDRESS(MATCH(Sheet3!$D$9,Sheet1!C:C,0)+1,3,4)),ROW(B9)-1,0))","v":""},{"$f":"IF(ROW(B9)-1>=$C$14,\"\",OFFSET(INDIRECT(MID(CELL(\"filename\",Sheet1!$A$15),FIND(\"]\",CELL(\"filename\",Sheet1!$A$15))+1,31)&\"!\"&ADDRESS(MATCH(Sheet3!$D$9,Sheet1!C:C,0)+1,3,4)),ROW(B9)-1+SUM($B$14:$B$14),0))","v":""},{"$f":"IF(ROW(B9)-1>=$D$14,\"\",OFFSET(INDIRECT(MID(CELL(\"filename\",Sheet1!$A$15),FIND(\"]\",CELL(\"filename\",Sheet1!$A$15))+1,31)&\"!\"&ADDRESS(MATCH(Sheet3!$D$9,Sheet1!C:C,0)+1,3,4)),ROW(B9)-1+SUM($B$14:$C$14),0))","v":""},{"$f":"IF(ROW(B9)-1>=$E$14,\"\",OFFSET(INDIRECT(MID(CELL(\"filename\",Sheet1!$A$15),FIND(\"]\",CELL(\"filename\",Sheet1!$A$15))+1,31)&\"!\"&ADDRESS(MATCH(Sheet3!$D$9,Sheet1!C:C,0)+1,3,4)),ROW(B9)-1+SUM($B$14:$D$14),0))","v":""},""]
[null,{"$f":"IF(ROW(B10)-1>=$B$14,\"\",OFFSET(INDIRECT(MID(CELL(\"filename\",Sheet1!$A$15),FIND(\"]\",CELL(\"filename\",Sheet1!$A$15))+1,31)&\"!\"&ADDRESS(MATCH(Sheet3!$D$9,Sheet1!C:C,0)+1,3,4)),ROW(B10)-1,0))","v":""},{"$f":"IF(ROW(B10)-1>=$C$14,\"\",OFFSET(INDIRECT(MID(CELL(\"filename\",Sheet1!$A$15),FIND(\"]\",CELL(\"filename\",Sheet1!$A$15))+1,31)&\"!\"&ADDRESS(MATCH(Sheet3!$D$9,Sheet1!C:C,0)+1,3,4)),ROW(B10)-1+SUM($B$14:$B$14),0))","v":""},{"$f":"IF(ROW(B10)-1>=$D$14,\"\",OFFSET(INDIRECT(MID(CELL(\"filename\",Sheet1!$A$15),FIND(\"]\",CELL(\"filename\",Sheet1!$A$15))+1,31)&\"!\"&ADDRESS(MATCH(Sheet3!$D$9,Sheet1!C:C,0)+1,3,4)),ROW(B10)-1+SUM($B$14:$C$14),0))","v":""},{"$f":"IF(ROW(B10)-1>=$E$14,\"\",OFFSET(INDIRECT(MID(CELL(\"filename\",Sheet1!$A$15),FIND(\"]\",CELL(\"filename\",Sheet1!$A$15))+1,31)&\"!\"&ADDRESS(MATCH(Sheet3!$D$9,Sheet1!C:C,0)+1,3,4)),ROW(B10)-1+SUM($B$14:$D$14),0))","v":""},""]
[null,{"$f":"IF(ROW(B11)-1>=$B$14,\"\",OFFSET(INDIRECT(MID(CELL(\"filename\",Sheet1!$A$15),FIND(\"]\",CELL(\"filename\",Sheet1!$A$15))+1,31)&\"!\"&ADDRESS(MATCH(Sheet3!$D$9,Sheet1!C:C,0)+1,3,4)),ROW(B11)-1,0))","v":""},{"$f":"IF(ROW(B11)-1>=$C$14,\"\",OFFSET(INDIRECT(MID(CELL(\"filename\",Sheet1!$A$15),FIND(\"]\",CELL(\"filename\",Sheet1!$A$15))+1,31)&\"!\"&ADDRESS(MATCH(Sheet3!$D$9,Sheet1!C:C,0)+1,3,4)),ROW(B11)-1+SUM($B$14:$B$14),0))","v":""},{"$f":"IF(ROW(B11)-1>=$D$14,\"\",OFFSET(INDIRECT(MID(CELL(\"filename\",Sheet1!$A$15),FIND(\"]\",CELL(\"filename\",Sheet1!$A$15))+1,31)&\"!\"&ADDRESS(MATCH(Sheet3!$D$9,Sheet1!C:C,0)+1,3,4)),ROW(B11)-1+SUM($B$14:$C$14),0))","v":""},{"$f":"IF(ROW(B11)-1>=$E$14,\"\",OFFSET(INDIRECT(MID(CELL(\"filename\",Sheet1!$A$15),FIND(\"]\",CELL(\"filename\",Sheet1!$A$15))+1,31)&\"!\"&ADDRESS(MATCH(Sheet3!$D$9,Sheet1!C:C,0)+1,3,4)),ROW(B11)-1+SUM($B$14:$D$14),0))","v":""},""]
[null,{"$f":"IF(ROW(B12)-1>=$B$14,\"\",OFFSET(INDIRECT(MID(CELL(\"filename\",Sheet1!$A$15),FIND(\"]\",CELL(\"filename\",Sheet1!$A$15))+1,31)&\"!\"&ADDRESS(MATCH(Sheet3!$D$9,Sheet1!C:C,0)+1,3,4)),ROW(B12)-1,0))","v":""},{"$f":"IF(ROW(B12)-1>=$C$14,\"\",OFFSET(INDIRECT(MID(CELL(\"filename\",Sheet1!$A$15),FIND(\"]\",CELL(\"filename\",Sheet1!$A$15))+1,31)&\"!\"&ADDRESS(MATCH(Sheet3!$D$9,Sheet1!C:C,0)+1,3,4)),ROW(B12)-1+SUM($B$14:$B$14),0))","v":""},{"$f":"IF(ROW(B12)-1>=$D$14,\"\",OFFSET(INDIRECT(MID(CELL(\"filename\",Sheet1!$A$15),FIND(\"]\",CELL(\"filename\",Sheet1!$A$15))+1,31)&\"!\"&ADDRESS(MATCH(Sheet3!$D$9,Sheet1!C:C,0)+1,3,4)),ROW(B12)-1+SUM($B$14:$C$14),0))","v":""},{"$f":"IF(ROW(B12)-1>=$E$14,\"\",OFFSET(INDIRECT(MID(CELL(\"filename\",Sheet1!$A$15),FIND(\"]\",CELL(\"filename\",Sheet1!$A$15))+1,31)&\"!\"&ADDRESS(MATCH(Sheet3!$D$9,Sheet1!C:C,0)+1,3,4)),ROW(B12)-1+SUM($B$14:$D$14),0))","v":""},""]
[null,{"$f":"IF(ROW(B13)-1>=$B$14,\"\",OFFSET(INDIRECT(MID(CELL(\"filename\",Sheet1!$A$15),FIND(\"]\",CELL(\"filename\",Sheet1!$A$15))+1,31)&\"!\"&ADDRESS(MATCH(Sheet3!$D$9,Sheet1!C:C,0)+1,3,4)),ROW(B13)-1,0))","v":""},{"$f":"IF(ROW(B13)-1>=$C$14,\"\",OFFSET(INDIRECT(MID(CELL(\"filename\",Sheet1!$A$15),FIND(\"]\",CELL(\"filename\",Sheet1!$A$15))+1,31)&\"!\"&ADDRESS(MATCH(Sheet3!$D$9,Sheet1!C:C,0)+1,3,4)),ROW(B13)-1+SUM($B$14:$B$14),0))","v":""},{"$f":"IF(ROW(B13)-1>=$D$14,\"\",OFFSET(INDIRECT(MID(CELL(\"filename\",Sheet1!$A$15),FIND(\"]\",CELL(\"filename\",Sheet1!$A$15))+1,31)&\"!\"&ADDRESS(MATCH(Sheet3!$D$9,Sheet1!C:C,0)+1,3,4)),ROW(B13)-1+SUM($B$14:$C$14),0))","v":""},{"$f":"IF(ROW(B13)-1>=$E$14,\"\",OFFSET(INDIRECT(MID(CELL(\"filename\",Sheet1!$A$15),FIND(\"]\",CELL(\"filename\",Sheet1!$A$15))+1,31)&\"!\"&ADDRESS(MATCH(Sheet3!$D$9,Sheet1!C:C,0)+1,3,4)),ROW(B13)-1+SUM($B$14:$D$14),0))","v":""},""]
[null,{"$f":"IF(ROW(B14)-1>=$B$14,\"\",OFFSET(INDIRECT(MID(CELL(\"filename\",Sheet1!$A$15),FIND(\"]\",CELL(\"filename\",Sheet1!$A$15))+1,31)&\"!\"&ADDRESS(MATCH(Sheet3!$D$9,Sheet1!C:C,0)+1,3,4)),ROW(B14)-1,0))","v":""},{"$f":"IF(ROW(B14)-1>=$C$14,\"\",OFFSET(INDIRECT(MID(CELL(\"filename\",Sheet1!$A$15),FIND(\"]\",CELL(\"filename\",Sheet1!$A$15))+1,31)&\"!\"&ADDRESS(MATCH(Sheet3!$D$9,Sheet1!C:C,0)+1,3,4)),ROW(B14)-1+SUM($B$14:$B$14),0))","v":""},{"$f":"IF(ROW(B14)-1>=$D$14,\"\",OFFSET(INDIRECT(MID(CELL(\"filename\",Sheet1!$A$15),FIND(\"]\",CELL(\"filename\",Sheet1!$A$15))+1,31)&\"!\"&ADDRESS(MATCH(Sheet3!$D$9,Sheet1!C:C,0)+1,3,4)),ROW(B14)-1+SUM($B$14:$C$14),0))","v":""},{"$f":"IF(ROW(B14)-1>=$E$14,\"\",OFFSET(INDIRECT(MID(CELL(\"filename\",Sheet1!$A$15),FIND(\"]\",CELL(\"filename\",Sheet1!$A$15))+1,31)&\"!\"&ADDRESS(MATCH(Sheet3!$D$9,Sheet1!C:C,0)+1,3,4)),ROW(B14)-1+SUM($B$14:$D$14),0))","v":""},""]
[null,{"$f":"IF(ROW(B15)-1>=$B$14,\"\",OFFSET(INDIRECT(MID(CELL(\"filename\",Sheet1!$A$15),FIND(\"]\",CELL(\"filename\",Sheet1!$A$15))+1,31)&\"!\"&ADDRESS(MATCH(Sheet3!$D$9,Sheet1!C:C,0)+1,3,4)),ROW(B15)-1,0))","v":""},{"$f":"IF(ROW(B15)-1>=$C$14,\"\",OFFSET(INDIRECT(MID(CELL(\"filename\",Sheet1!$A$15),FIND(\"]\",CELL(\"filename\",Sheet1!$A$15))+1,31)&\"!\"&ADDRESS(MATCH(Sheet3!$D$9,Sheet1!C:C,0)+1,3,4)),ROW(B15)-1+SUM($B$14:$B$14),0))","v":""},{"$f":"IF(ROW(B15)-1>=$D$14,\"\",OFFSET(INDIRECT(MID(CELL(\"filename\",Sheet1!$A$15),FIND(\"]\",CELL(\"filename\",Sheet1!$A$15))+1,31)&\"!\"&ADDRESS(MATCH(Sheet3!$D$9,Sheet1!C:C,0)+1,3,4)),ROW(B15)-1+SUM($B$14:$C$14),0))","v":""},{"$f":"IF(ROW(B15)-1>=$E$14,\"\",OFFSET(INDIRECT(MID(CELL(\"filename\",Sheet1!$A$15),FIND(\"]\",CELL(\"filename\",Sheet1!$A$15))+1,31)&\"!\"&ADDRESS(MATCH(Sheet3!$D$9,Sheet1!C:C,0)+1,3,4)),ROW(B15)-1+SUM($B$14:$D$14),0))","v":""},""]
[null,{"$f":"IF(ROW(B16)-1>=$B$14,\"\",OFFSET(INDIRECT(MID(CELL(\"filename\",Sheet1!$A$15),FIND(\"]\",CELL(\"filename\",Sheet1!$A$15))+1,31)&\"!\"&ADDRESS(MATCH(Sheet3!$D$9,Sheet1!C:C,0)+1,3,4)),ROW(B16)-1,0))","v":""},{"$f":"IF(ROW(B16)-1>=$C$14,\"\",OFFSET(INDIRECT(MID(CELL(\"filename\",Sheet1!$A$15),FIND(\"]\",CELL(\"filename\",Sheet1!$A$15))+1,31)&\"!\"&ADDRESS(MATCH(Sheet3!$D$9,Sheet1!C:C,0)+1,3,4)),ROW(B16)-1+SUM($B$14:$B$14),0))","v":""},{"$f":"IF(ROW(B16)-1>=$D$14,\"\",OFFSET(INDIRECT(MID(CELL(\"filename\",Sheet1!$A$15),FIND(\"]\",CELL(\"filename\",Sheet1!$A$15))+1,31)&\"!\"&ADDRESS(MATCH(Sheet3!$D$9,Sheet1!C:C,0)+1,3,4)),ROW(B16)-1+SUM($B$14:$C$14),0))","v":""},{"$f":"IF(ROW(B16)-1>=$E$14,\"\",OFFSET(INDIRECT(MID(CELL(\"filename\",Sheet1!$A$15),FIND(\"]\",CELL(\"filename\",Sheet1!$A$15))+1,31)&\"!\"&ADDRESS(MATCH(Sheet3!$D$9,Sheet1!C:C,0)+1,3,4)),ROW(B16)-1+SUM($B$14:$D$14),0))","v":""},""]
[null,{"$f":"IF(ROW(B17)-1>=$B$14,\"\",OFFSET(INDIRECT(MID(CELL(\"filename\",Sheet1!$A$15),FIND(\"]\",CELL(\"filename\",Sheet1!$A$15))+1,31)&\"!\"&ADDRESS(MATCH(Sheet3!$D$9,Sheet1!C:C,0)+1,3,4)),ROW(B17)-1,0))","v":""},{"$f":"IF(ROW(B17)-1>=$C$14,\"\",OFFSET(INDIRECT(MID(CELL(\"filename\",Sheet1!$A$15),FIND(\"]\",CELL(\"filename\",Sheet1!$A$15))+1,31)&\"!\"&ADDRESS(MATCH(Sheet3!$D$9,Sheet1!C:C,0)+1,3,4)),ROW(B17)-1+SUM($B$14:$B$14),0))","v":""},{"$f":"IF(ROW(B17)-1>=$D$14,\"\",OFFSET(INDIRECT(MID(CELL(\"filename\",Sheet1!$A$15),FIND(\"]\",CELL(\"filename\",Sheet1!$A$15))+1,31)&\"!\"&ADDRESS(MATCH(Sheet3!$D$9,Sheet1!C:C,0)+1,3,4)),ROW(B17)-1+SUM($B$14:$C$14),0))","v":""},{"$f":"IF(ROW(B17)-1>=$E$14,\"\",OFFSET(INDIRECT(MID(CELL(\"filename\",Sheet1!$A$15),FIND(\"]\",CELL(\"filename\",Sheet1!$A$15))+1,31)&\"!\"&ADDRESS(MATCH(Sheet3!$D$9,Sheet1!C:C,0)+1,3,4)),ROW(B17)-1+SUM($B$14:$D$14),0))","v":""},""]
[null,{"$f":"IF(ROW(B18)-1>=$B$14,\"\",OFFSET(INDIRECT(MID(CELL(\"filename\",Sheet1!$A$15),FIND(\"]\",CELL(\"filename\",Sheet1!$A$15))+1,31)&\"!\"&ADDRESS(MATCH(Sheet3!$D$9,Sheet1!C:C,0)+1,3,4)),ROW(B18)-1,0))","v":""},{"$f":"IF(ROW(B18)-1>=$C$14,\"\",OFFSET(INDIRECT(MID(CELL(\"filename\",Sheet1!$A$15),FIND(\"]\",CELL(\"filename\",Sheet1!$A$15))+1,31)&\"!\"&ADDRESS(MATCH(Sheet3!$D$9,Sheet1!C:C,0)+1,3,4)),ROW(B18)-1+SUM($B$14:$B$14),0))","v":""},{"$f":"IF(ROW(B18)-1>=$D$14,\"\",OFFSET(INDIRECT(MID(CELL(\"filename\",Sheet1!$A$15),FIND(\"]\",CELL(\"filename\",Sheet1!$A$15))+1,31)&\"!\"&ADDRESS(MATCH(Sheet3!$D$9,Sheet1!C:C,0)+1,3,4)),ROW(B18)-1+SUM($B$14:$C$14),0))","v":""},{"$f":"IF(ROW(B18)-1>=$E$14,\"\",OFFSET(INDIRECT(MID(CELL(\"filename\",Sheet1!$A$15),FIND(\"]\",CELL(\"filename\",Sheet1!$A$15))+1,31)&\"!\"&ADDRESS(MATCH(Sheet3!$D$9,Sheet1!C:C,0)+1,3,4)),ROW(B18)-1+SUM($B$14:$D$14),0))","v":""},""]
[null,{"$f":"IF(ROW(B19)-1>=$B$14,\"\",OFFSET(INDIRECT(MID(CELL(\"filename\",Sheet1!$A$15),FIND(\"]\",CELL(\"filename\",Sheet1!$A$15))+1,31)&\"!\"&ADDRESS(MATCH(Sheet3!$D$9,Sheet1!C:C,0)+1,3,4)),ROW(B19)-1,0))","v":""},{"$f":"IF(ROW(B19)-1>=$C$14,\"\",OFFSET(INDIRECT(MID(CELL(\"filename\",Sheet1!$A$15),FIND(\"]\",CELL(\"filename\",Sheet1!$A$15))+1,31)&\"!\"&ADDRESS(MATCH(Sheet3!$D$9,Sheet1!C:C,0)+1,3,4)),ROW(B19)-1+SUM($B$14:$B$14),0))","v":""},{"$f":"IF(ROW(B19)-1>=$D$14,\"\",OFFSET(INDIRECT(MID(CELL(\"filename\",Sheet1!$A$15),FIND(\"]\",CELL(\"filename\",Sheet1!$A$15))+1,31)&\"!\"&ADDRESS(MATCH(Sheet3!$D$9,Sheet1!C:C,0)+1,3,4)),ROW(B19)-1+SUM($B$14:$C$14),0))","v":""},{"$f":"IF(ROW(B19)-1>=$E$14,\"\",OFFSET(INDIRECT(MID(CELL(\"filename\",Sheet1!$A$15),FIND(\"]\",CELL(\"filename\",Sheet1!$A$15))+1,31)&\"!\"&ADDRESS(MATCH(Sheet3!$D$9,Sheet1!C:C,0)+1,3,4)),ROW(B19)-1+SUM($B$14:$D$14),0))","v":""},""]
[null,{"$f":"IF(ROW(B20)-1>=$B$14,\"\",OFFSET(INDIRECT(MID(CELL(\"filename\",Sheet1!$A$15),FIND(\"]\",CELL(\"filename\",Sheet1!$A$15))+1,31)&\"!\"&ADDRESS(MATCH(Sheet3!$D$9,Sheet1!C:C,0)+1,3,4)),ROW(B20)-1,0))","v":""},{"$f":"IF(ROW(B20)-1>=$C$14,\"\",OFFSET(INDIRECT(MID(CELL(\"filename\",Sheet1!$A$15),FIND(\"]\",CELL(\"filename\",Sheet1!$A$15))+1,31)&\"!\"&ADDRESS(MATCH(Sheet3!$D$9,Sheet1!C:C,0)+1,3,4)),ROW(B20)-1+SUM($B$14:$B$14),0))","v":""},{"$f":"IF(ROW(B20)-1>=$D$14,\"\",OFFSET(INDIRECT(MID(CELL(\"filename\",Sheet1!$A$15),FIND(\"]\",CELL(\"filename\",Sheet1!$A$15))+1,31)&\"!\"&ADDRESS(MATCH(Sheet3!$D$9,Sheet1!C:C,0)+1,3,4)),ROW(B20)-1+SUM($B$14:$C$14),0))","v":""},{"$f":"IF(ROW(B20)-1>=$E$14,\"\",OFFSET(INDIRECT(MID(CELL(\"filename\",Sheet1!$A$15),FIND(\"]\",CELL(\"filename\",Sheet1!$A$15))+1,31)&\"!\"&ADDRESS(MATCH(Sheet3!$D$9,Sheet1!C:C,0)+1,3,4)),ROW(B20)-1+SUM($B$14:$D$14),0))","v":""},""]
[]
[null,"परीक्षा प्रभारी",null,null,"केन्द्राधीक्षक "]
[null,{"$f":"Sheet2!$B$37","v":"XYZ (Lecturer)"},null,null,{"$f":"Sheet2!$E$37","v":"XYZ (Principal)"}]

{"sheet":"Sheet5","index":4,"n_rows":37,"n_cols":6,"rows_kept":37,"merged":[[0,1,0,4],[1,1,1,4],[2,1,2,4],[3,1,3,4],[4,1,4,4],[5,1,5,4],[7,1,7,4],[8,1,8,2],[8,3,8,4],[9,1,9,4],[10,1,10,4],[11,1,11,4]]}
[null,{"$f":"Sheet2!$B$1","v":"Half Yearly Examination 2024"}]
[null,"परीक्षा केंद्र नाम एवं परीक्षा केंद्र क्रमांक"]
[null,{"$f":"Sheet2!$B$3","v":"Govt Sr Sc School Malutana (216405)"}]
[null,"परीक्षा कक्ष / हॉल क्रमांक"]
[null,{"$f":"Sheet2!$K$4","v":{"v":4,"d":"04"}}]
[null,"परीक्षा दिनांक (दिवस) ... से ... तक"]
[null,{"$f":"Sheet2!$B$7","v":"14-12-2024"},{"$f":"IF(B7=\"\",\"\",TEXT(B7,\"DDDD\"))","v":"Saturday"},{"$f":"Sheet2!$D$7","v":"24-12-2024"},{"$f":"IF(D7=\"\",\"\",TEXT(D7,\"DDDD\"))","v":"Tuesday"}]
[null,"परीक्षार्थी रोल नंबर ... से ... तक"]
[null,{"$f":"IF(B14>0,B15,IF(C14>0,C15,IF(D14>0,D15,IF(E14>0,E15,0))))","v":2024},null,{"$f":"IF(E14>0,LOOKUP(2,1/(E15:E34<>\"\"),E15:E34),IF(D14>0,LOOKUP(2,1/(D15:D34<>\"\"),D15:D34),IF(C14>0,LOOKUP(2,1/(C15:C34<>\"\"),C15:C34),IF(B14>0,LOOKUP(2,1/(B15:B34<>\"\"),B15:B34),0))))","v":1038}]
[null,"कुल सम्मिलित परीक्षार्थी "]
[null,{"$f":"COUNTIF($B$15:$E$34,\">0\")","v":42}]
[null,"परीक्षार्थी बैठक व्यवस्था"]
[null,"पंक्ति 1","पंक्ति 2","पंक्ति 3","पंक्ति 4"]
[null,{"$f":"Sheet2!L4","v":10},{"$f":"Sheet2!M4","v":11},{"$f":"Sheet2!N4","v":12},{"$f":"Sheet2!O4","v":9}]
[null,{"$f":"IF(ROW(B1)-1>=$B$14,\"\",OFFSET(INDIRECT(MID(CELL(\"filename\",Sheet1!$A$15),FIND(\"]\",CELL(\"filename\",Sheet1!$A$15))+1,31)&\"!\"&ADDRESS(MATCH(Sheet4!$D$9,Sheet1!C:C,0)+1,3,4)),ROW(B1)-1,0))","v":2024},{"$f":"IF(ROW(B1)-1>=$C$14,\"\",OFFSET(INDIRECT(MID(CELL(\"filename\",Sheet1!$A$15),FIND(\"]\",CELL(\"filename\",Sheet1!$A$15))+1,31)&\"!\"&ADDRESS(MATCH(Sheet4!$D$9,Sheet1!C:C,0)+1,3,4)),ROW(B1)-1+SUM($B$14:$B$14),0))","v":128},{"$f":"IF(ROW(B1)-1>=$D$14,\"\",OFFSET(INDIRECT(MID(CELL(\"filename\",Sheet1!$A$15),FIND(\"]\",CELL(\"filename\",Sheet1!$A$15))+1,31)&\"!\"&ADDRESS(MATCH(Sheet4!$D$9,Sheet1!C:C,0)+1,3,4)),ROW(B1)-1+SUM($B$14:$C$14),0))","v":2031},{"$f":"IF(ROW(B1)-1>=$E$14,\"\",OFFSET(INDIRECT(MID(CELL(\"filename\",Sheet1!$A$15),FIND(\"]\",CELL(\"filename\",Sheet1!$A$15))+1,31)&\"!\"&ADDRESS(MATCH(Sheet4!$D$9,Sheet1!C:C,0)+1,3,4)),ROW(B1)-1+SUM($B$14:$D$14),0))","v":2035},{"$f":"IF(SUM(B15:E15)>0,1,\"\")","v":1}]
[null,{"$f":"IF(ROW(B2)-1>=$B$14,\"\",OFFSET(INDIRECT(MID(CELL(\"filename\",Sheet1!$A$15),FIND(\"]\",CELL(\"filename\",Sheet1!$A$15))+1,31)&\"!\"&ADDRESS(MATCH(Sheet4!$D$9,Sheet1!C:C,0)+1,3,4)),ROW(B2)-1,0))","v":125},{"$f":"IF(ROW(B2)-1>=$C$14,\"\",OFFSET(INDIRECT(MID(CELL(\"filename\",Sheet1!$A$15),FIND(\"]\",CELL(\"filename\",Sheet1!$A$15))+1,31)&\"!\"&ADDRESS(MATCH(Sheet4!$D$9,Sheet1!C:C,0)+1,3,4)),ROW(B2)-1+SUM($B$14:$B$14),0))","v":1028},{"$f":"IF(ROW(B2)-1>=$D$14,\"\",OFFSET(INDIRECT(MID(CELL(\"filename\",Sheet1!$A$15),FIND(\"]\",CELL(\"filename\",Sheet1!$A$15))+1,31)&\"!\"&ADDRESS(MATCH(Sheet4!$D$9,Sheet1!C:C,0)+1,3,4)),ROW(B2)-1+SUM($B$14:$C$14),0))","v":132},{"$f":"IF(ROW(B2)-1>=$E$14,\"\",OFFSET(INDIRECT(MID(CELL(\"filename\",Sheet1!$A$15),FIND(\"]\",CELL(\"filename\",Sheet1!$A$15))+1,31)&\"!\"&ADDRESS(MATCH(Sheet4!$D$9,Sheet1!C:C,0)+1,3,4)),ROW(B2)-1+SUM($B$14:$D$14),0))","v":136},{"$f":"IF(SUM(B16:E16)>0,1,\"\")","v":1}]
[null,{"$f":"IF(ROW(B3)-1>=$B$14,\"\",OFFSET(INDIRECT(MID(CELL(\"filename\",Sheet1!$A$15),FIND(\"]\",CELL(\"filename\",Sheet1!$A$15))+1,31)&\"!\"&ADDRESS(MATCH(Sheet4!$D$9,Sheet1!C:C,0)+1,3,4)),ROW(B3)-1,0))","v":1025},{"$f":"IF(ROW(B3)-1>=$C$14,\"\",OFFSET(INDIRECT(MID(CELL(\"filename\",Sheet1!$A$15),FIND(\"]\",CELL(\"filename\",Sheet1!$A$15))+1,31)&\"!\"&ADDRESS(MATCH(Sheet4!$D$9,Sheet1!C:C,0)+1,3,4)),ROW(B3)-1+SUM($B$14:$B$14),0))","v":2028},{"$f":"IF(ROW(B3)-1>=$D$14,\"\",OFFSET(INDIRECT(MID(CELL(\"filename\",Sheet1!$A$15),FIND(\"]\",CELL(\"filename\",Sheet1!$A$15))+1,31)&\"!\"&ADDRESS(MATCH(Sheet4!$D$9,Sheet1!C:C,0)+1,3,4)),ROW(B3)-1+SUM($B$14:$C$14),0))","v":1032},{"$f":"IF(ROW(B3)-1>=$E$14,\"\",OFFSET(INDIRECT(MID(CELL(\"filename\",Sheet1!$A$15),FIND(\"]\",CELL(\"filename\",Sheet1!$A$15))+1,31)&\"!\"&ADDRESS(MATCH(Sheet4!$D$9,Sheet1!C:C,0)+1,3,4)),ROW(B3)-1+SUM($B$14:$D$14),0))","v":1036},1]
[null,{"$f":"IF(ROW(B4)-1>=$B$14,\"\",OFFSET(INDIRECT(MID(CELL(\"filename\",Sheet1!$A$15),FIND(\"]\",CELL(\"filename\",Sheet1!$A$15))+1,31)&\"!\"&ADDRESS(MATCH(Sheet4!$D$9,Sheet1!C:C,0)+1,3,4)),ROW(B4)-1,0))","v":2025},{"$f":"IF(ROW(B4)-1>=$C$14,\"\",OFFSET(INDIRECT(MID(CELL(\"filename\",Sheet1!$A$15),FIND(\"]\",CELL(\"filename\",Sheet1!$A$15))+1,31)&\"!\"&ADDRESS(MATCH(Sheet4!$D$9,Sheet1!C:C,0)+1,3,4)),ROW(B4)-1+SUM($B$14:$B$14),0))","v":129},{"$f":"IF(ROW(B4)-1>=$D$14,\"\",OFFSET(INDIRECT(MID(CELL(\"filename\",Sheet1!$A$15),FIND(\"]\",CELL(\"filename\",Sheet1!$A$15))+1,31)&\"!\"&ADDRESS(MATCH(Sheet4!$D$9,Sheet1!C:C,0)+1,3,4)),ROW(B4)-1+SUM($B$14:$C$14),0))","v":2032},{"$f":"IF(ROW(B4)-1>=$E$14,\"\",OFFSET(INDIRECT(MID(CELL(\"filename\",Sheet1!$A$15),FIND(\"]\",CELL(\"filename\",Sheet1!$A$15))+1,31)&\"!\"&ADDRESS(MATCH(Sheet4!$D$9,Sheet1!C:C,0)+1,3,4)),ROW(B4)-1+SUM($B$14:$D$14),0))","v":2036},1]
[null,{"$f":"IF(ROW(B5)-1>=$B$14,\"\",OFFSET(INDIRECT(MID(CELL(\"filename\",Sheet1!$A$15),FIND(\"]\",CELL(\"filename\",Sheet1!$A$15))+1,31)&\"!\"&ADDRESS(MATCH(Sheet4!$D$9,Sheet1!C:C,0)+1,3,4)),ROW(B5)-1,0))","v":126},{"$f":"IF(ROW(B5)-1>=$C$14,\"\",OFFSET(INDIRECT(MID(CELL(\"filename\",Sheet1!$A$15),FIND(\"]\",CELL(\"filename\",Sheet1!$A$15))+1,31)&\"!\"&ADDRESS(MATCH(Sheet4!$D$9,Sheet1!C:C,0)+1,3,4)),ROW(B5)-1+SUM($B$14:$B$14),0))","v":1029},{"$f":"IF(ROW(B5)-1>=$D$14,\"\",OFFSET(INDIRECT(MID(CELL(\"filename\",Sheet1!$A$15),FIND(\"]\",CELL(\"filename\",Sheet1!$A$15))+1,31)&\"!\"&ADDRESS(MATCH(Sheet4!$D$9,Sheet1!C:C,0)+1,3,4)),ROW(B5)-1+SUM($B$14:$C$14),0))","v":133},{"$f":"IF(ROW(B5)-1>=$E$14,\"\",OFFSET(INDIRECT(MID(CELL(\"filename\",Sheet1!$A$15),FIND(\"]\",CELL(\"filename\",Sheet1!$A$15))+1,31)&\"!\"&ADDRESS(MATCH(Sheet4!$D$9,Sheet1!C:C,0)+1,3,4)),ROW(B5)-1+SUM($B$14:$D$14),0))","v":137},1]
[null,{"$f":"IF(ROW(B6)-1>=$B$14,\"\",OFFSET(INDIRECT(MID(CELL(\"filename\",Sheet1!$A$15),FIND(\"]\",CELL(\"filename\",Sheet1!$A$15))+1,31)&\"!\"&ADDRESS(MATCH(Sheet4!$D$9,Sheet1!C:C,0)+1,3,4)),ROW(B6)-1,0))","v":1026},{"$f":"IF(ROW(B6)-1>=$C$14,\"\",OFFSET(INDIRECT(MID(CELL(\"filename\",Sheet1!$A$15),FIND(\"]\",CELL(\"filename\",Sheet1!$A$15))+1,31)&\"!\"&ADDRESS(MATCH(Sheet4!$D$9,Sheet1!C:C,0)+1,3,4)),ROW(B6)-1+SUM($B$14:$B$14),0))","v":2029},{"$f":"IF(ROW(B6)-1>=$D$14,\"\",OFFSET(INDIRECT(MID(CELL(\"filename\",Sheet1!$A$15),FIND(\"]\",CELL(\"filename\",Sheet1!$A$15))+1,31)&\"!\"&ADDRESS(MATCH(Sheet4!$D$9,Sheet1!C:C,0)+1,3,4)),ROW(B6)-1+SUM($B$14:$C$14),0))","v":1033},{"$f":"IF(ROW(B6)-1>=$E$14,\"\",OFFSET(INDIRECT(MID(CELL(\"filename\",Sheet1!$A$15),FIND(\"]\",CELL(\"filename\",Sheet1!$A$15))+1,31)&\"!\"&ADDRESS(MATCH(Sheet4!$D$9,Sheet1!C:C,0)+1,3,4)),ROW(B6)-1+SUM($B$14:$D$14),0))","v":1037},1]
[null,{"$f":"IF(ROW(B7)-1>=$B$14,\"\",OFFSET(INDIRECT(MID(CELL(\"filename\",Sheet1!$A$15),FIND(\"]\",CELL(\"filename\",Sheet1!$A$15))+1,31)&\"!\"&ADDRESS(MATCH(Sheet4!$D$9,Sheet1!C:C,0)+1,3,4)),ROW(B7)-1,0))","v":2026},{"$f":"IF(ROW(B7)-1>=$C$14,\"\",OFFSET(INDIRECT(MID(CELL(\"filename\",Sheet1!$A$15),FIND(\"]\",CELL(\"filename\",Sheet1!$A$15))+1,31)&\"!\"&ADDRESS(MATCH(Sheet4!$D$9,Sheet1!C:C,0)+1,3,4)),ROW(B7)-1+SUM($B$14:$B$14),0))","v":130},{"$f":"IF(ROW(B7)-1>=$D$14,\"\",OFFSET(INDIRECT(MID(CELL(\"filename\",Sheet1!$A$15),FIND(\"]\",CELL(\"filename\",Sheet1!$A$15))+1,31)&\"!\"&ADDRESS(MATCH(Sheet4!$D$9,Sheet1!C:C,0)+1,3,4)),ROW(B7)-1+SUM($B$14:$C$14),0))","v":2033},{"$f":"IF(ROW(B7)-1>=$E$14,\"\",OFFSET(INDIRECT(MID(CELL(\"filename\",Sheet1!$A$15),FIND(\"]\",CELL(\"filename\",Sheet1!$A$15))+1,31)&\"!\"&ADDRESS(MATCH(Sheet4!$D$9,Sheet1!C:C,0)+1,3,4)),ROW(B7)-1+SUM($B$14:$D$14),0))","v":2037},1]
[null,{"$f":"IF(ROW(B8)-1>=$B$14,\"\",OFFSET(INDIRECT(MID(CELL(\"filename\",Sheet1!$A$15),FIND(\"]\",CELL(\"filename\",Sheet1!$A$15))+1,31)&\"!\"&ADDRESS(MATCH(Sheet4!$D$9,Sheet1!C:C,0)+1,3,4)),ROW(B8)-1,0))","v":127},{"$f":"IF(ROW(B8)-1>=$C$14,\"\",OFFSET(INDIRECT(MID(CELL(\"filename\",Sheet1!$A$15),FIND(\"]\",CELL(\"filename\",Sheet1!$A$15))+1,31)&\"!\"&ADDRESS(MATCH(Sheet4!$D$9,Sheet1!C:C,0)+1,3,4)),ROW(B8)-1+SUM($B$14:$B$14),0))","v":1030},{"$f":"IF(ROW(B8)-1>=$D$14,\"\",OFFSET(INDIRECT(MID(CELL(\"filename\",Sheet1!$A$15),FIND(\"]\",CELL(\"filename\",Sheet1!$A$15))+1,31)&\"!\"&ADDRESS(MATCH(Sheet4!$D$9,Sheet1!C:C,0)+1,3,4)),ROW(B8)-1+SUM($B$14:$C$14),0))","v":134},{"$f":"IF(ROW(B8)-1>=$E$14,\"\",OFFSET(INDIRECT(MID(CELL(\"filename\",Sheet1!$A$15),FIND(\"]\",CELL(\"filename\",Sheet1!$A$15))+1,31)&\"!\"&ADDRESS(MATCH(Sheet4!$D$9,Sheet1!C:C,0)+1,3,4)),ROW(B8)-1+SUM($B$14:$D$14),0))","v":138},1]
[null,{"$f":"IF(ROW(B9)-1>=$B$14,\"\",OFFSET(INDIRECT(MID(CELL(\"filename\",Sheet1!$A$15),FIND(\"]\",CELL(\"filename\",Sheet1!$A$15))+1,31)&\"!\"&ADDRESS(MATCH(Sheet4!$D$9,Sheet1!C:C,0)+1,3,4)),ROW(B9)-1,0))","v":1027},{"$f":"IF(ROW(B9)-1>=$C$14,\"\",OFFSET(INDIRECT(MID(CELL(\"filename\",Sheet1!$A$15),FIND(\"]\",CELL(\"filename\",Sheet1!$A$15))+1,31)&\"!\"&ADDRESS(MATCH(Sheet4!$D$9,Sheet1!C:C,0)+1,3,4)),ROW(B9)-1+SUM($B$14:$B$14),0))","v":2030},{"$f":"IF(ROW(B9)-1>=$D$14,\"\",OFFSET(INDIRECT(MID(CELL(\"filename\",Sheet1!$A$15),FIND(\"]\",CELL(\"filename\",Sheet1!$A$15))+1,31)&\"!\"&ADDRESS(MATCH(Sheet4!$D$9,Sheet1!C:C,0)+1,3,4)),ROW(B9)-1+SUM($B$14:$C$14),0))","v":1034},{"$f":"IF(ROW(B9)-1>=$E$14,\"\",OFFSET(INDIRECT(MID(CELL(\"filename\",Sheet1!$A$15),FIND(\"]\",CELL(\"filename\",Sheet1!$A$15))+1,31)&\"!\"&ADDRESS(MATCH(Sheet4!$D$9,Sheet1!C:C,0)+1,3,4)),ROW(B9)-1+SUM($B$14:$D$14),0))","v":1038},1]
[null,{"$f":"IF(ROW(B10)-1>=$B$14,\"\",OFFSET(INDIRECT(MID(CELL(\"filename\",Sheet1!$A$15),FIND(\"]\",CELL(\"filename\",Sheet1!$A$15))+1,31)&\"!\"&ADDRESS(MATCH(Sheet4!$D$9,Sheet1!C:C,0)+1,3,4)),ROW(B10)-1,0))","v":2027},{"$f":"IF(ROW(B10)-1>=$C$14,\"\",OFFSET(INDIRECT(MID(CELL(\"filename\",Sheet1!$A$15),FIND(\"]\",CELL(\"filename\",Sheet1!$A$15))+1,31)&\"!\"&ADDRESS(MATCH(Sheet4!$D$9,Sheet1!C:C,0)+1,3,4)),ROW(B10)-1+SUM($B$14:$B$14),0))","v":131},{"$f":"IF(ROW(B10)-1>=$D$14,\"\",OFFSET(INDIRECT(MID(CELL(\"filename\",Sheet1!$A$15),FIND(\"]\",CELL(\"filename\",Sheet1!$A$15))+1,31)&\"!\"&ADDRESS(MATCH(Sheet4!$D$9,Sheet1!C:C,0)+1,3,4)),ROW(B10)-1+SUM($B$14:$C$14),0))","v":2034},{"$f":"IF(ROW(B10)-1>=$E$14,\"\",OFFSET(INDIRECT(MID(CELL(\"filename\",Sheet1!$A$15),FIND(\"]\",CELL(\"filename\",Sheet1!$A$15))+1,31)&\"!\"&ADDRESS(MATCH(Sheet4!$D$9,Sheet1!C:C,0)+1,3,4)),ROW(B10)-1+SUM($B$14:$D$14),0))","v":""},1]
[null,{"$f":"IF(ROW(B11)-1>=$B$14,\"\",OFFSET(INDIRECT(MID(CELL(\"filename\",Sheet1!$A$15),FIND(\"]\",CELL(\"filename\",Sheet1!$A$15))+1,31)&\"!\"&ADDRESS(MATCH(Sheet4!$D$9,Sheet1!C:C,0)+1,3,4)),ROW(B11)-1,0))","v":""},{"$f":"IF(ROW(B11)-1>=$C$14,\"\",OFFSET(INDIRECT(MID(CELL(\"filename\",Sheet1!$A$15),FIND(\"]\",CELL(\"filename\",Sheet1!$A$15))+1,31)&\"!\"&ADDRESS(MATCH(Sheet4!$D$9,Sheet1!C:C,0)+1,3,4)),ROW(B11)-1+SUM($B$14:$B$14),0))","v":1031},{"$f":"IF(ROW(B11)-1>=$D$14,\"\",OFFSET(INDIRECT(MID(CELL(\"filename\",Sheet1!$A$15),FIND(\"]\",CELL(\"filename\",Sheet1!$A$15))+1,31)&\"!\"&ADDRESS(MATCH(Sheet4!$D$9,Sheet1!C:C,0)+1,3,4)),ROW(B11)-1+SUM($B$14:$C$14),0))","v":135},{"$f":"IF(ROW(B11)-1>=$E$14,\"\",OFFSET(INDIRECT(MID(CELL(\"filename\",Sheet1!$A$15),FIND(\"]\",CELL(\"filename\",Sheet1!$A$15))+1,31)&\"!\"&ADDRESS(MATCH(Sheet4!$D$9,Sheet1!C:C,0)+1,3,4)),ROW(B11)-1+SUM($B$14:$D$14),0))","v":""},1]
[null,{"$f":"IF(ROW(B12)-1>=$B$14,\"\",OFFSET(INDIRECT(MID(CELL(\"filename\",Sheet1!$A$15),FIND(\"]\",CELL(\"filename\",Sheet1!$A$15))+1,31)&\"!\"&ADDRESS(MATCH(Sheet4!$D$9,Sheet1!C:C,0)+1,3,4)),ROW(B12)-1,0))","v":""},{"$f":"IF(ROW(B12)-1>=$C$14,\"\",OFFSET(INDIRECT(MID(CELL(\"filename\",Sheet1!$A$15),FIND(\"]\",CELL(\"filename\",Sheet1!$A$15))+1,31)&\"!\"&ADDRESS(MATCH(Sheet4!$D$9,Sheet1!C:C,0)+1,3,4)),ROW(B12)-1+SUM($B$14:$B$14),0))","v":""},{"$f":"IF(ROW(B12)-1>=$D$14,\"\",OFFSET(INDIRECT(MID(CELL(\"filename\",Sheet1!$A$15),FIND(\"]\",CELL(\"filename\",Sheet1!$A$15))+1,31)&\"!\"&ADDRESS(MATCH(Sheet4!$D$9,Sheet1!C:C,0)+1,3,4)),ROW(B12)-1+SUM($B$14:$C$14),0))","v":1035},{"$f":"IF(ROW(B12)-1>=$E$14,\"\",OFFSET(INDIRECT(MID(CELL(\"filename\",Sheet1!$A$15),FIND(\"]\",CELL(\"filename\",Sheet1!$A$15))+1,31)&\"!\"&ADDRESS(MATCH(Sheet4!$D$9,Sheet1!C:C,0)+1,3,4)),ROW(B12)-1+SUM($B$14:$D$14),0))","v":""},1]
[null,{"$f":"IF(ROW(B13)-1>=$B$14,\"\",OFFSET(INDIRECT(MID(CELL(\"filename\",Sheet1!$A$15),FIND(\"]\",CELL(\"filename\",Sheet1!$A$15))+1,31)&\"!\"&ADDRESS(MATCH(Sheet4!$D$9,Sheet1!C:C,0)+1,3,4)),ROW(B13)-1,0))","v":""},{"$f":"IF(ROW(B13)-1>=$C$14,\"\",OFFSET(INDIRECT(MID(CELL(\"filename\",Sheet1!$A$15),FIND(\"]\",CELL(\"filename\",Sheet1!$A$15))+1,31)&\"!\"&ADDRESS(MATCH(Sheet4!$D$9,Sheet1!C:C,0)+1,3,4)),ROW(B13)-1+SUM($B$14:$B$14),0))","v":""},{"$f":"IF(ROW(B13)-1>=$D$14,\"\",OFFSET(INDIRECT(MID(CELL(\"filename\",Sheet1!$A$15),FIND(\"]\",CELL(\"filename\",Sheet1!$A$15))+1,31)&\"!\"&ADDRESS(MATCH(Sheet4!$D$9,Sheet1!C:C,0)+1,3,4)),ROW(B13)-1+SUM($B$14:$C$14),0))","v":""},{"$f":"IF(ROW(B13)-1>=$E$14,\"\",OFFSET(INDIRECT(MID(CELL(\"filename\",Sheet1!$A$15),FIND(\"]\",CELL(\"filename\",Sheet1!$A$15))+1,31)&\"!\"&ADDRESS(MATCH(Sheet4!$D$9,Sheet1!C:C,0)+1,3,4)),ROW(B13)-1+SUM($B$14:$D$14),0))","v":""},""]
[null,{"$f":"IF(ROW(B14)-1>=$B$14,\"\",OFFSET(INDIRECT(MID(CELL(\"filename\",Sheet1!$A$15),FIND(\"]\",CELL(\"filename\",Sheet1!$A$15))+1,31)&\"!\"&ADDRESS(MATCH(Sheet4!$D$9,Sheet1!C:C,0)+1,3,4)),ROW(B14)-1,0))","v":""},{"$f":"IF(ROW(B14)-1>=$C$14,\"\",OFFSET(INDIRECT(MID(CELL(\"filename\",Sheet1!$A$15),FIND(\"]\",CELL(\"filename\",Sheet1!$A$15))+1,31)&\"!\"&ADDRESS(MATCH(Sheet4!$D$9,Sheet1!C:C,0)+1,3,4)),ROW(B14)-1+SUM($B$14:$B$14),0))","v":""},{"$f":"IF(ROW(B14)-1>=$D$14,\"\",OFFSET(INDIRECT(MID(CELL(\"filename\",Sheet1!$A$15),FIND(\"]\",CELL(\"filename\",Sheet1!$A$15))+1,31)&\"!\"&ADDRESS(MATCH(Sheet4!$D$9,Sheet1!C:C,0)+1,3,4)),ROW(B14)-1+SUM($B$14:$C$14),0))","v":""},{"$f":"IF(ROW(B14)-1>=$E$14,\"\",OFFSET(INDIRECT(MID(CELL(\"filename\",Sheet1!$A$15),FIND(\"]\",CELL(\"filename\",Sheet1!$A$15))+1,31)&\"!\"&ADDRESS(MATCH(Sheet4!$D$9,Sheet1!C:C,0)+1,3,4)),ROW(B14)-1+SUM($B$14:$D$14),0))","v":""},""]
[null,{"$f":"IF(ROW(B15)-1>=$B$14,\"\",OFFSET(INDIRECT(MID(CELL(\"filename\",Sheet1!$A$15),FIND(\"]\",CELL(\"filename\",Sheet1!$A$15))+1,31)&\"!\"&ADDRESS(MATCH(Sheet4!$D$9,Sheet1!C:C,0)+1,3,4)),ROW(B15)-1,0))","v":""},{"$f":"IF(ROW(B15)-1>=$C$14,\"\",OFFSET(INDIRECT(MID(CELL(\"filename\",Sheet1!$A$15),FIND(\"]\",CELL(\"filename\",Sheet1!$A$15))+1,31)&\"!\"&ADDRESS(MATCH(Sheet4!$D$9,Sheet1!C:C,0)+1,3,4)),ROW(B15)-1+SUM($B$14:$B$14),0))","v":""},{"$f":"IF(ROW(B15)-1>=$D$14,\"\",OFFSET(INDIRECT(MID(CELL(\"filename\",Sheet1!$A$15),FIND(\"]\",CELL(\"filename\",Sheet1!$A$15))+1,31)&\"!\"&ADDRESS(MATCH(Sheet4!$D$9,Sheet1!C:C,0)+1,3,4)),ROW(B15)-1+SUM($B$14:$C$14),0))","v":""},{"$f":"IF(ROW(B15)-1>=$E$14,\"\",OFFSET(INDIRECT(MID(CELL(\"filename\",Sheet1!$A$15),FIND(\"]\",CELL(\"filename\",Sheet1!$A$15))+1,31)&\"!\"&ADDRESS(MATCH(Sheet4!$D$9,Sheet1!C:C,0)+1,3,4)),ROW(B15)-1+SUM($B$14:$D$14),0))","v":""},""]
[null,{"$f":"IF(ROW(B16)-1>=$B$14,\"\",OFFSET(INDIRECT(MID(CELL(\"filename\",Sheet1!$A$15),FIND(\"]\",CELL(\"filename\",Sheet1!$A$15))+1,31)&\"!\"&ADDRESS(MATCH(Sheet4!$D$9,Sheet1!C:C,0)+1,3,4)),ROW(B16)-1,0))","v":""},{"$f":"IF(ROW(B16)-1>=$C$14,\"\",OFFSET(INDIRECT(MID(CELL(\"filename\",Sheet1!$A$15),FIND(\"]\",CELL(\"filename\",Sheet1!$A$15))+1,31)&\"!\"&ADDRESS(MATCH(Sheet4!$D$9,Sheet1!C:C,0)+1,3,4)),ROW(B16)-1+SUM($B$14:$B$14),0))","v":""},{"$f":"IF(ROW(B16)-1>=$D$14,\"\",OFFSET(INDIRECT(MID(CELL(\"filename\",Sheet1!$A$15),FIND(\"]\",CELL(\"filename\",Sheet1!$A$15))+1,31)&\"!\"&ADDRESS(MATCH(Sheet4!$D$9,Sheet1!C:C,0)+1,3,4)),ROW(B16)-1+SUM($B$14:$C$14),0))","v":""},{"$f":"IF(ROW(B16)-1>=$E$14,\"\",OFFSET(INDIRECT(MID(CELL(\"filename\",Sheet1!$A$15),FIND(\"]\",CELL(\"filename\",Sheet1!$A$15))+1,31)&\"!\"&ADDRESS(MATCH(Sheet4!$D$9,Sheet1!C:C,0)+1,3,4)),ROW(B16)-1+SUM($B$14:$D$14),0))","v":""},""]
[null,{"$f":"IF(ROW(B17)-1>=$B$14,\"\",OFFSET(INDIRECT(MID(CELL(\"filename\",Sheet1!$A$15),FIND(\"]\",CELL(\"filename\",Sheet1!$A$15))+1,31)&\"!\"&ADDRESS(MATCH(Sheet4!$D$9,Sheet1!C:C,0)+1,3,4)),ROW(B17)-1,0))","v":""},{"$f":"IF(ROW(B17)-1>=$C$14,\"\",OFFSET(INDIRECT(MID(CELL(\"filename\",Sheet1!$A$15),FIND(\"]\",CELL(\"filename\",Sheet1!$A$15))+1,31)&\"!\"&ADDRESS(MATCH(Sheet4!$D$9,Sheet1!C:C,0)+1,3,4)),ROW(B17)-1+SUM($B$14:$B$14),0))","v":""},{"$f":"IF(ROW(B17)-1>=$D$14,\"\",OFFSET(INDIRECT(MID(CELL(\"filename\",Sheet1!$A$15),FIND(\"]\",CELL(\"filename\",Sheet1!$A$15))+1,31)&\"!\"&ADDRESS(MATCH(Sheet4!$D$9,Sheet1!C:C,0)+1,3,4)),ROW(B17)-1+SUM($B$14:$C$14),0))","v":""},{"$f":"IF(ROW(B17)-1>=$E$14,\"\",OFFSET(INDIRECT(MID(CELL(\"filename\",Sheet1!$A$15),FIND(\"]\",CELL(\"filename\",Sheet1!$A$15))+1,31)&\"!\"&ADDRESS(MATCH(Sheet4!$D$9,Sheet1!C:C,0)+1,3,4)),ROW(B17)-1+SUM($B$14:$D$14),0))","v":""},""]
[null,{"$f":"IF(ROW(B18)-1>=$B$14,\"\",OFFSET(INDIRECT(MID(CELL(\"filename\",Sheet1!$A$15),FIND(\"]\",CELL(\"filename\",Sheet1!$A$15))+1,31)&\"!\"&ADDRESS(MATCH(Sheet4!$D$9,Sheet1!C:C,0)+1,3,4)),ROW(B18)-1,0))","v":""},{"$f":"IF(ROW(B18)-1>=$C$14,\"\",OFFSET(INDIRECT(MID(CELL(\"filename\",Sheet1!$A$15),FIND(\"]\",CELL(\"filename\",Sheet1!$A$15))+1,31)&\"!\"&ADDRESS(MATCH(Sheet4!$D$9,Sheet1!C:C,0)+1,3,4)),ROW(B18)-1+SUM($B$14:$B$14),0))","v":""},{"$f":"IF(ROW(B18)-1>=$D$14,\"\",OFFSET(INDIRECT(MID(CELL(\"filename\",Sheet1!$A$15),FIND(\"]\",CELL(\"filename\",Sheet1!$A$15))+1,31)&\"!\"&ADDRESS(MATCH(Sheet4!$D$9,Sheet1!C:C,0)+1,3,4)),ROW(B18)-1+SUM($B$14:$C$14),0))","v":""},{"$f":"IF(ROW(B18)-1>=$E$14,\"\",OFFSET(INDIRECT(MID(CELL(\"filename\",Sheet1!$A$15),FIND(\"]\",CELL(\"filename\",Sheet1!$A$15))+1,31)&\"!\"&ADDRESS(MATCH(Sheet4!$D$9,Sheet1!C:C,0)+1,3,4)),ROW(B18)-1+SUM($B$14:$D$14),0))","v":""},""]
[null,{"$f":"IF(ROW(B19)-1>=$B$14,\"\",OFFSET(INDIRECT(MID(CELL(\"filename\",Sheet1!$A$15),FIND(\"]\",CELL(\"filename\",Sheet1!$A$15))+1,31)&\"!\"&ADDRESS(MATCH(Sheet4!$D$9,Sheet1!C:C,0)+1,3,4)),ROW(B19)-1,0))","v":""},{"$f":"IF(ROW(B19)-1>=$C$14,\"\",OFFSET(INDIRECT(MID(CELL(\"filename\",Sheet1!$A$15),FIND(\"]\",CELL(\"filename\",Sheet1!$A$15))+1,31)&\"!\"&ADDRESS(MATCH(Sheet4!$D$9,Sheet1!C:C,0)+1,3,4)),ROW(B19)-1+SUM($B$14:$B$14),0))","v":""},{"$f":"IF(ROW(B19)-1>=$D$14,\"\",OFFSET(INDIRECT(MID(CELL(\"filename\",Sheet1!$A$15),FIND(\"]\",CELL(\"filename\",Sheet1!$A$15))+1,31)&\"!\"&ADDRESS(MATCH(Sheet4!$D$9,Sheet1!C:C,0)+1,3,4)),ROW(B19)-1+SUM($B$14:$C$14),0))","v":""},{"$f":"IF(ROW(B19)-1>=$E$14,\"\",OFFSET(INDIRECT(MID(CELL(\"filename\",Sheet1!$A$15),FIND(\"]\",CELL(\"filename\",Sheet1!$A$15))+1,31)&\"!\"&ADDRESS(MATCH(Sheet4!$D$9,Sheet1!C:C,0)+1,3,4)),ROW(B19)-1+SUM($B$14:$D$14),0))","v":""},""]
[null,{"$f":"IF(ROW(B20)-1>=$B$14,\"\",OFFSET(INDIRECT(MID(CELL(\"filename\",Sheet1!$A$15),FIND(\"]\",CELL(\"filename\",Sheet1!$A$15))+1,31)&\"!\"&ADDRESS(MATCH(Sheet4!$D$9,Sheet1!C:C,0)+1,3,4)),ROW(B20)-1,0))","v":""},{"$f":"IF(ROW(B20)-1>=$C$14,\"\",OFFSET(INDIRECT(MID(CELL(\"filename\",Sheet1!$A$15),FIND(\"]\",CELL(\"filename\",Sheet1!$A$15))+1,31)&\"!\"&ADDRESS(MATCH(Sheet4!$D$9,Sheet1!C:C,0)+1,3,4)),ROW(B20)-1+SUM($B$14:$B$14),0))","v":""},{"$f":"IF(ROW(B20)-1>=$D$14,\"\",OFFSET(INDIRECT(MID(CELL(\"filename\",Sheet1!$A$15),FIND(\"]\",CELL(\"filename\",Sheet1!$A$15))+1,31)&\"!\"&ADDRESS(MATCH(Sheet4!$D$9,Sheet1!C:C,0)+1,3,4)),ROW(B20)-1+SUM($B$14:$C$14),0))","v":""},{"$f":"IF(ROW(B20)-1>=$E$14,\"\",OFFSET(INDIRECT(MID(CELL(\"filename\",Sheet1!$A$15),FIND(\"]\",CELL(\"filename\",Sheet1!$A$15))+1,31)&\"!\"&ADDRESS(MATCH(Sheet4!$D$9,Sheet1!C:C,0)+1,3,4)),ROW(B20)-1+SUM($B$14:$D$14),0))","v":""},""]
[]
[null,"परीक्षा प्रभारी",null,null,"केन्द्राधीक्षक "]
[null,{"$f":"Sheet2!$B$37","v":"XYZ (Lecturer)"},null,null,{"$f":"Sheet2!$E$37","v":"XYZ (Principal)"}]

{"sheet":"Sheet6","index":5,"n_rows":37,"n_cols":6,"rows_kept":37,"merged":[[0,1,0,4],[1,1,1,4],[2,1,2,4],[3,1,3,4],[4,1,4,4],[5,1,5,4],[7,1,7,4],[8,1,8,2],[8,3,8,4],[9,1,9,4],[10,1,10,4],[11,1,11,4]]}
[null,{"$f":"Sheet2!$B$1","v":"Half Yearly Examination 2024"}]
[null,"परीक्षा केंद्र नाम एवं परीक्षा केंद्र क्रमांक"]
[null,{"$f":"Sheet2!$B$3","v":"Govt Sr Sc School Malutana (216405)"}]
[null,"परीक्षा कक्ष / हॉल क्रमांक"]
[null,{"$f":"Sheet2!$K$5","v":{"v":5,"d":"05"}}]
[null,"परीक्षा दिनांक (दिवस) ... से ... तक"]
[null,{"$f":"Sheet2!$B$7","v":"14-12-2024"},{"$f":"IF(B7=\"\",\"\",TEXT(B7,\"DDDD\"))","v":"Saturday"},{"$f":"Sheet2!$D$7","v":"24-12-2024"},{"$f":"IF(D7=\"\",\"\",TEXT(D7,\"DDDD\"))","v":"Tuesday"}]
[null,"परीक्षार्थी रोल नंबर ... से ... तक"]
[null,{"$f":"IF(B14>0,B15,IF(C14>0,C15,IF(D14>0,D15,IF(E14>0,E15,0))))","v":2038},null,{"$f":"IF(E14>0,LOOKUP(2,1/(E15:E34<>\"\"),E15:E34),IF(D14>0,LOOKUP(2,1/(D15:D34<>\"\"),D15:D34),IF(C14>0,LOOKUP(2,1/(C15:C34<>\"\"),C15:C34),IF(B14>0,LOOKUP(2,1/(B15:B34<>\"\"),B15:B34),0))))","v":159}]
[null,"कुल सम्मिलित परीक्षार्थी "]
[null,{"$f":"COUNTIF($B$15:$E$34,\">0\")","v":62}]
[null,"परीक्षार्थी बैठक व्यवस्था"]
[null,"पंक्ति 1","पंक्ति 2","पंक्ति 3","पंक्ति 4"]
[null,{"$f":"Sheet2!L5","v":14},{"$f":"Sheet2!M5","v":15},{"$f":"Sheet2!N5","v":20},{"$f":"Sheet2!O5","v":13}]
[null,{"$f":"IF(ROW(B1)-1>=$B$14,\"\",OFFSET(INDIRECT(MID(CELL(\"filename\",Sheet1!$A$15),FIND(\"]\",CELL(\"filename\",Sheet1!$A$15))+1,31)&\"!\"&ADDRESS(MATCH(Sheet5!$D$9,Sheet1!C:C,0)+1,3,4)),ROW(B1)-1,0))","v":2038},{"$f":"IF(ROW(B1)-1>=$C$14,\"\",OFFSET(INDIRECT(MID(CELL(\"filename\",Sheet1!$A$15),FIND(\"]\",CELL(\"filename\",Sheet1!$A$15))+1,31)&\"!\"&ADDRESS(MATCH(Sheet5!$D$9,Sheet1!C:C,0)+1,3,4)),ROW(B1)-1+SUM($B$14:$B$14),0))","v":1043},{"$f":"IF(ROW(B1)-1>=$D$14,\"\",OFFSET(INDIRECT(MID(CELL(\"filename\",Sheet1!$A$15),FIND(\"]\",CELL(\"filename\",Sheet1!$A$15))+1,31)&\"!\"&ADDRESS(MATCH(Sheet5!$D$9,Sheet1!C:C,0)+1,3,4)),ROW(B1)-1+SUM($B$14:$C$14),0))","v":1048},{"$f":"IF(ROW(B1)-1>=$E$14,\"\",OFFSET(INDIRECT(MID(CELL(\"filename\",Sheet1!$A$15),FIND(\"]\",CELL(\"filename\",Sheet1!$A$15))+1,31)&\"!\"&ADDRESS(MATCH(Sheet5!$D$9,Sheet1!C:C,0)+1,3,4)),ROW(B1)-1+SUM($B$14:$D$14),0))","v":155},{"$f":"IF(SUM(B15:E15)>0,1,\"\")","v":1}]
[null,{"$f":"IF(ROW(B2)-1>=$B$14,\"\",OFFSET(INDIRECT(MID(CELL(\"filename\",Sheet1!$A$15),FIND(\"]\",CELL(\"filename\",Sheet1!$A$15))+1,31)&\"!\"&ADDRESS(MATCH(Sheet5!$D$9,Sheet1!C:C,0)+1,3,4)),ROW(B2)-1,0))","v":139},{"$f":"IF(ROW(B2)-1>=$C$14,\"\",OFFSET(INDIRECT(MID(CELL(\"filename\",Sheet1!$A$15),FIND(\"]\",CELL(\"filename\",Sheet1!$A$15))+1,31)&\"!\"&ADDRESS(MATCH(Sheet5!$D$9,Sheet1!C:C,0)+1,3,4)),ROW(B2)-1+SUM($B$14:$B$14),0))","v":2043},{"$f":"IF(ROW(B2)-1>=$D$14,\"\",OFFSET(INDIRECT(MID(CELL(\"filename\",Sheet1!$A$15),FIND(\"]\",CELL(\"filename\",Sheet1!$A$15))+1,31)&\"!\"&ADDRESS(MATCH(Sheet5!$D$9,Sheet1!C:C,0)+1,3,4)),ROW(B2)-1+SUM($B$14:$C$14),0))","v":2048},{"$f":"IF(ROW(B2)-1>=$E$14,\"\",OFFSET(INDIRECT(MID(CELL(\"filename\",Sheet1!$A$15),FIND(\"]\",CELL(\"filename\",Sheet1!$A$15))+1,31)&\"!\"&ADDRESS(MATCH(Sheet5!$D$9,Sheet1!C:C,0)+1,3,4)),ROW(B2)-1+SUM($B$14:$D$14),0))","v":1055},{"$f":"IF(SUM(B16:E16)>0,1,\"\")","v":1}]
[null,{"$f":"IF(ROW(B3)-1>=$B$14,\"\",OFFSET(INDIRECT(MID(CELL(\"filename\",Sheet1!$A$15),FIND(\"]\",CELL(\"filename\",Sheet1!$A$15))+1,31)&\"!\"&ADDRESS(MATCH(Sheet5!$D$9,Sheet1!C:C,0)+1,3,4)),ROW(B3)-1,0))","v":1039},{"$f":"IF(ROW(B3)-1>=$C$14,\"\",OFFSET(INDIRECT(MID(CELL(\"filename\",Sheet1!$A$15),FIND(\"]\",CELL(\"filename\",Sheet1!$A$15))+1,31)&\"!\"&ADDRESS(MATCH(Sheet5!$D$9,Sheet1!C:C,0)+1,3,4)),ROW(B3)-1+SUM($B$14:$B$14),0))","v":144},{"$f":"IF(ROW(B3)-1>=$D$14,\"\",OFFSET(INDIRECT(MID(CELL(\"filename\",Sheet1!$A$15),FIND(\"]\",CELL(\"filename\",Sheet1!$A$15))+1,31)&\"!\"&ADDRESS(MATCH(Sheet5!$D$9,Sheet1!C:C,0)+1,3,4)),ROW(B3)-1+SUM($B$14:$C$14),0))","v":149},{"$f":"IF(ROW(B3)-1>=$E$14,\"\",OFFSET(INDIRECT(MID(CELL(\"filename\",Sheet1!$A$15),FIND(\"]\",CELL(\"filename\",Sheet1!$A$15))+1,31)&\"!\"&ADDRESS(MATCH(Sheet5!$D$9,Sheet1!C:C,0)+1,3,4)),ROW(B3)-1+SUM($B$14:$D$14),0))","v":2055},1]
[null,{"$f":"IF(ROW(B4)-1>=$B$14,\"\",OFFSET(INDIRECT(MID(CELL(\"filename\",Sheet1!$A$15),FIND(\"]\",CELL(\"filename\",Sheet1!$A$15))+1,31)&\"!\"&ADDRESS(MATCH(Sheet5!$D$9,Sheet1!C:C,0)+1,3,4)),ROW(B4)-1,0))","v":2039},{"$f":"IF(ROW(B4)-1>=$C$14,\"\",OFFSET(INDIRECT(MID(CELL(\"filename\",Sheet1!$A$15),FIND(\"]\",CELL(\"filename\",Sheet1!$A$15))+1,31)&\"!\"&ADDRESS(MATCH(Sheet5!$D$9,Sheet1!C:C,0)+1,3,4)),ROW(B4)-1+SUM($B$14:$B$14),0))","v":1044},{"$f":"IF(ROW(B4)-1>=$D$14,\"\",OFFSET(INDIRECT(MID(CELL(\"filename\",Sheet1!$A$15),FIND(\"]\",CELL(\"filename\",Sheet1!$A$15))+1,31)&\"!\"&ADDRESS(MATCH(Sheet5!$D$9,Sheet1!C:C,0)+1,3,4)),ROW(B4)-1+SUM($B$14:$C$14),0))","v":1049},{"$f":"IF(ROW(B4)-1>=$E$14,\"\",OFFSET(INDIRECT(MID(CELL(\"filename\",Sheet1!$A$15),FIND(\"]\",CELL(\"filename\",Sheet1!$A$15))+1,31)&\"!\"&ADDRESS(MATCH(Sheet5!$D$9,Sheet1!C:C,0)+1,3,4)),ROW(B4)-1+SUM($B$14:$D$14),0))","v":156},1]
[null,{"$f":"IF(ROW(B5)-1>=$B$14,\"\",OFFSET(INDIRECT(MID(CELL(\"filename\",Sheet1!$A$15),FIND(\"]\",CELL(\"filename\",Sheet1!$A$15))+1,31)&\"!\"&ADDRESS(MATCH(Sheet5!$D$9,Sheet1!C:C,0)+1,3,4)),ROW(B5)-1,0))","v":140},{"$f":"IF(ROW(B5)-1>=$C$14,\"\",OFFSET(INDIRECT(MID(CELL(\"filename\",Sheet1!$A$15),FIND(\"]\",CELL(\"filename\",Sheet1!$A$15))+1,31)&\"!\"&ADDRESS(MATCH(Sheet5!$D$9,Sheet1!C:C,0)+1,3,4)),ROW(B5)-1+SUM($B$14:$B$14),0))","v":2044},{"$f":"IF(ROW(B5)-1>=$D$14,\"\",OFFSET(INDIRECT(MID(CELL(\"filename\",Sheet1!$A$15),FIND(\"]\",CELL(\"filename\",Sheet1!$A$15))+1,31)&\"!\"&ADDRESS(MATCH(Sheet5!$D$9,Sheet1!C:C,0)+1,3,4)),ROW(B5)-1+SUM($B$14:$C$14),0))","v":2049},{"$f":"IF(ROW(B5)-1>=$E$14,\"\",OFFSET(INDIRECT(MID(CELL(\"filename\",Sheet1!$A$15),FIND(\"]\",CELL(\"filename\",Sheet1!$A$15))+1,31)&\"!\"&ADDRESS(MATCH(Sheet5!$D$9,Sheet1!C:C,0)+1,3,4)),ROW(B5)-1+SUM($B$14:$D$14),0))","v":1056},1]
[null,{"$f":"IF(ROW(B6)-1>=$B$14,\"\",OFFSET(INDIRECT(MID(CELL(\"filename\",Sheet1!$A$15),FIND(\"]\",CELL(\"filename\",Sheet1!$A$15))+1,31)&\"!\"&ADDRESS(MATCH(Sheet5!$D$9,Sheet1!C:C,0)+1,3,4)),ROW(B6)-1,0))","v":1040},{"$f":"IF(ROW(B6)-1>=$C$14,\"\",OFFSET(INDIRECT(MID(CELL(\"filename\",Sheet1!$A$15),FIND(\"]\",CELL(\"filename\",Sheet1!$A$15))+1,31)&\"!\"&ADDRESS(MATCH(Sheet5!$D$9,Sheet1!C:C,0)+1,3,4)),ROW(B6)-1+SUM($B$14:$B$14),0))","v":145},{"$f":"IF(ROW(B6)-1>=$D$14,\"\",OFFSET(INDIRECT(MID(CELL(\"filename\",Sheet1!$A$15),FIND(\"]\",CELL(\"filename\",Sheet1!$A$15))+1,31)&\"!\"&ADDRESS(MATCH(Sheet5!$D$9,Sheet1!C:C,0)+1,3,4)),ROW(B6)-1+SUM($B$14:$C$14),0))","v":150},{"$f":"IF(ROW(B6)-1>=$E$14,\"\",OFFSET(INDIRECT(MID(CELL(\"filename\",Sheet1!$A$15),FIND(\"]\",CELL(\"filename\",Sheet1!$A$15))+1,31)&\"!\"&ADDRESS(MATCH(Sheet5!$D$9,Sheet1!C:C,0)+1,3,4)),ROW(B6)-1+SUM($B$14:$D$14),0))","v":2056},1]
[null,{"$f":"IF(ROW(B7)-1>=$B$14,\"\",OFFSET(INDIRECT(MID(CELL(\"filename\",Sheet1!$A$15),FIND(\"]\",CELL(\"filename\",Sheet1!$A$15))+1,31)&\"!\"&ADDRESS(MATCH(Sheet5!$D$9,Sheet1!C:C,0)+1,3,4)),ROW(B7)-1,0))","v":2040},{"$f":"IF(ROW(B7)-1>=$C$14,\"\",OFFSET(INDIRECT(MID(CELL(\"filename\",Sheet1!$A$15),FIND(\"]\",CELL(\"filename\",Sheet1!$A$15))+1,31)&\"!\"&ADDRESS(MATCH(Sheet5!$D$9,Sheet1!C:C,0)+1,3,4)),ROW(B7)-1+SUM($B$14:$B$14),0))","v":1045},{"$f":"IF(ROW(B7)-1>=$D$14,\"\",OFFSET(INDIRECT(MID(CELL(\"filename\",Sheet1!$A$15),FIND(\"]\",CELL(\"filename\",Sheet1!$A$15))+1,31)&\"!\"&ADDRESS(MATCH(Sheet5!$D$9,Sheet1!C:C,0)+1,3,4)),ROW(B7)-1+SUM($B$14:$C$14),0))","v":1050},{"$f":"IF(ROW(B7)-1>=$E$14,\"\",OFFSET(INDIRECT(MID(CELL(\"filename\",Sheet1!$A$15),FIND(\"]\",CELL(\"filename\",Sheet1!$A$15))+1,31)&\"!\"&ADDRESS(MATCH(Sheet5!$D$9,Sheet1!C:C,0)+1,3,4)),ROW(B7)-1+SUM($B$14:$D$14),0))","v":157},1]
[null,{"$f":"IF(ROW(B8)-1>=$B$14,\"\",OFFSET(INDIRECT(MID(CELL(\"filename\",Sheet1!$A$15),FIND(\"]\",CELL(\"filename\",Sheet1!$A$15))+1,31)&\"!\"&ADDRESS(MATCH(Sheet5!$D$9,Sheet1!C:C,0)+1,3,4)),ROW(B8)-1,0))","v":141},{"$f":"IF(ROW(B8)-1>=$C$14,\"\",OFFSET(INDIRECT(MID(CELL(\"filename\",Sheet1!$A$15),FIND(\"]\",CELL(\"filename\",Sheet1!$A$15))+1,31)&\"!\"&ADDRESS(MATCH(Sheet5!$D$9,Sheet1!C:C,0)+1,3,4)),ROW(B8)-1+SUM($B$14:$B$14),0))","v":2045},{"$f":"IF(ROW(B8)-1>=$D$14,\"\",OFFSET(INDIRECT(MID(CELL(\"filename\",Sheet1!$A$15),FIND(\"]\",CELL(\"filename\",Sheet1!$A$15))+1,31)&\"!\"&ADDRESS(MATCH(Sheet5!$D$9,Sheet1!C:C,0)+1,3,4)),ROW(B8)-1+SUM($B$14:$C$14),0))","v":2050},{"$f":"IF(ROW(B8)-1>=$E$14,\"\",OFFSET(INDIRECT(MID(CELL(\"filename\",Sheet1!$A$15),FIND(\"]\",CELL(\"filename\",Sheet1!$A$15))+1,31)&\"!\"&ADDRESS(MATCH(Sheet5!$D$9,Sheet1!C:C,0)+1,3,4)),ROW(B8)-1+SUM($B$14:$D$14),0))","v":1057},1]
[null,{"$f":"IF(ROW(B9)-1>=$B$14,\"\",OFFSET(INDIRECT(MID(CELL(\"filename\",Sheet1!$A$15),FIND(\"]\",CELL(\"filename\",Sheet1!$A$15))+1,31)&\"!\"&ADDRESS(MATCH(Sheet5!$D$9,Sheet1!C:C,0)+1,3,4)),ROW(B9)-1,0))","v":1041},{"$f":"IF(ROW(B9)-1>=$C$14,\"\",OFFSET(INDIRECT(MID(CELL(\"filename\",Sheet1!$A$15),FIND(\"]\",CELL(\"filename\",Sheet1!$A$15))+1,31)&\"!\"&ADDRESS(MATCH(Sheet5!$D$9,Sheet1!C:C,0)+1,3,4)),ROW(B9)-1+SUM($B$14:$B$14),0))","v":146},{"$f":"IF(ROW(B9)-1>=$D$14,\"\",OFFSET(INDIRECT(MID(CELL(\"filename\",Sheet1!$A$15),FIND(\"]\",CELL(\"filename\",Sheet1!$A$15))+1,31)&\"!\"&ADDRESS(MATCH(Sheet5!$D$9,Sheet1!C:C,0)+1,3,4)),ROW(B9)-1+SUM($B$14:$C$14),0))","v":151},{"$f":"IF(ROW(B9)-1>=$E$14,\"\",OFFSET(INDIRECT(MID(CELL(\"filename\",Sheet1!$A$15),FIND(\"]\",CELL(\"filename\",Sheet1!$A$15))+1,31)&\"!\"&ADDRESS(MATCH(Sheet5!$D$9,Sheet1!C:C,0)+1,3,4)),ROW(B9)-1+SUM($B$14:$D$14),0))","v":2057},1]
[null,{"$f":"IF(ROW(B10)-1>=$B$14,\"\",OFFSET(INDIRECT(MID(CELL(\"filename\",Sheet1!$A$15),FIND(\"]\",CELL(\"filename\",Sheet1!$A$15))+1,31)&\"!\"&ADDRESS(MATCH(Sheet5!$D$9,Sheet1!C:C,0)+1,3,4)),ROW(B10)-1,0))","v":2041},{"$f":"IF(ROW(B10)-1>=$C$14,\"\",OFFSET(INDIRECT(MID(CELL(\"filename\",Sheet1!$A$15),FIND(\"]\",CELL(\"filename\",Sheet1!$A$15))+1,31)&\"!\"&ADDRESS(MATCH(Sheet5!$D$9,Sheet1!C:C,0)+1,3,4)),ROW(B10)-1+SUM($B$14:$B$14),0))","v":1046},{"$f":"IF(ROW(B10)-1>=$D$14,\"\",OFFSET(INDIRECT(MID(CELL(\"filename\",Sheet1!$A$15),FIND(\"]\",CELL(\"filename\",Sheet1!$A$15))+1,31)&\"!\"&ADDRESS(MATCH(Sheet5!$D$9,Sheet1!C:C,0)+1,3,4)),ROW(B10)-1+SUM($B$14:$C$14),0))","v":1051},{"$f":"IF(ROW(B10)-1>=$E$14,\"\",OFFSET(INDIRECT(MID(CELL(\"filename\",Sheet1!$A$15),FIND(\"]\",CELL(\"filename\",Sheet1!$A$15))+1,31)&\"!\"&ADDRESS(MATCH(Sheet5!$D$9,Sheet1!C:C,0)+1,3,4)),ROW(B10)-1+SUM($B$14:$D$14),0))","v":158},1]
[null,{"$f":"IF(ROW(B11)-1>=$B$14,\"\",OFFSET(INDIRECT(MID(CELL(\"filename\",Sheet1!$A$15),FIND(\"]\",CELL(\"filename\",Sheet1!$A$15))+1,31)&\"!\"&ADDRESS(MATCH(Sheet5!$D$9,Sheet1!C:C,0)+1,3,4)),ROW(B11)-1,0))","v":142},{"$f":"IF(ROW(B11)-1>=$C$14,\"\",OFFSET(INDIRECT(MID(CELL(\"filename\",Sheet1!$A$15),FIND(\"]\",CELL(\"filename\",Sheet1!$A$15))+1,31)&\"!\"&ADDRESS(MATCH(Sheet5!$D$9,Sheet1!C:C,0)+1,3,4)),ROW(B11)-1+SUM($B$14:$B$14),0))","v":2046},{"$f":"IF(ROW(B11)-1>=$D$14,\"\",OFFSET(INDIRECT(MID(CELL(\"filename\",Sheet1!$A$15),FIND(\"]\",CELL(\"filename\",Sheet1!$A$15))+1,31)&\"!\"&ADDRESS(MATCH(Sheet5!$D$9,Sheet1!C:C,0)+1,3,4)),ROW(B11)-1+SUM($B$14:$C$14),0))","v":2051},{"$f":"IF(ROW(B11)-1>=$E$14,\"\",OFFSET(INDIRECT(MID(CELL(\"filename\",Sheet1!$A$15),FIND(\"]\",CELL(\"filename\",Sheet1!$A$15))+1,31)&\"!\"&ADDRESS(MATCH(Sheet5!$D$9,Sheet1!C:C,0)+1,3,4)),ROW(B11)-1+SUM($B$14:$D$14),0))","v":1058},1]
[null,{"$f":"IF(ROW(B12)-1>=$B$14,\"\",OFFSET(INDIRECT(MID(CELL(\"filename\",Sheet1!$A$15),FIND(\"]\",CELL(\"filename\",Sheet1!$A$15))+1,31)&\"!\"&ADDRESS(MATCH(Sheet5!$D$9,Sheet1!C:C,0)+1,3,4)),ROW(B12)-1,0))","v":1042},{"$f":"IF(ROW(B12)-1>=$C$14,\"\",OFFSET(INDIRECT(MID(CELL(\"filename\",Sheet1!$A$15),FIND(\"]\",CELL(\"filename\",Sheet1!$A$15))+1,31)&\"!\"&ADDRESS(MATCH(Sheet5!$D$9,Sheet1!C:C,0)+1,3,4)),ROW(B12)-1+SUM($B$14:$B$14),0))","v":147},{"$f":"IF(ROW(B12)-1>=$D$14,\"\",OFFSET(INDIRECT(MID(CELL(\"filename\",Sheet1!$A$15),FIND(\"]\",CELL(\"filename\",Sheet1!$A$15))+1,31)&\"!\"&ADDRESS(MATCH(Sheet5!$D$9,Sheet1!C:C,0)+1,3,4)),ROW(B12)-1+SUM($B$14:$C$14),0))","v":152},{"$f":"IF(ROW(B12)-1>=$E$14,\"\",OFFSET(INDIRECT(MID(CELL(\"filename\",Sheet1!$A$15),FIND(\"]\",CELL(\"filename\",Sheet1!$A$15))+1,31)&\"!\"&ADDRESS(MATCH(Sheet5!$D$9,Sheet1!C:C,0)+1,3,4)),ROW(B12)-1+SUM($B$14:$D$14),0))","v":2058},1]
[null,{"$f":"IF(ROW(B13)-1>=$B$14,\"\",OFFSET(INDIRECT(MID(CELL(\"filename\",Sheet1!$A$15),FIND(\"]\",CELL(\"filename\",Sheet1!$A$15))+1,31)&\"!\"&ADDRESS(MATCH(Sheet5!$D$9,Sheet1!C:C,0)+1,3,4)),ROW(B13)-1,0))","v":2042},{"$f":"IF(ROW(B13)-1>=$C$14,\"\",OFFSET(INDIRECT(MID(CELL(\"filename\",Sheet1!$A$15),FIND(\"]\",CELL(\"filename\",Sheet1!$A$15))+1,31)&\"!\"&ADDRESS(MATCH(Sheet5!$D$9,Sheet1!C:C,0)+1,3,4)),ROW(B13)-1+SUM($B$14:$B$14),0))","v":1047},{"$f":"IF(ROW(B13)-1>=$D$14,\"\",OFFSET(INDIRECT(MID(CELL(\"filename\",Sheet1!$A$15),FIND(\"]\",CELL(\"filename\",Sheet1!$A$15))+1,31)&\"!\"&ADDRESS(MATCH(Sheet5!$D$9,Sheet1!C:C,0)+1,3,4)),ROW(B13)-1+SUM($B$14:$C$14),0))","v":1052},{"$f":"IF(ROW(B13)-1>=$E$14,\"\",OFFSET(INDIRECT(MID(CELL(\"filename\",Sheet1!$A$15),FIND(\"]\",CELL(\"filename\",Sheet1!$A$15))+1,31)&\"!\"&ADDRESS(MATCH(Sheet5!$D$9,Sheet1!C:C,0)+1,3,4)),ROW(B13)-1+SUM($B$14:$D$14),0))","v":159},1]
[null,{"$f":"IF(ROW(B14)-1>=$B$14,\"\",OFFSET(INDIRECT(MID(CELL(\"filename\",Sheet1!$A$15),FIND(\"]\",CELL(\"filename\",Sheet1!$A$15))+1,31)&\"!\"&ADDRESS(MATCH(Sheet5!$D$9,Sheet1!C:C,0)+1,3,4)),ROW(B14)-1,0))","v":143},{"$f":"IF(ROW(B14)-1>=$C$14,\"\",OFFSET(INDIRECT(MID(CELL(\"filename\",Sheet1!$A$15),FIND(\"]\",CELL(\"filename\",Sheet1!$A$15))+1,31)&\"!\"&ADDRESS(MATCH(Sheet5!$D$9,Sheet1!C:C,0)+1,3,4)),ROW(B14)-1+SUM($B$14:$B$14),0))","v":2047},{"$f":"IF(ROW(B14)-1>=$D$14,\"\",OFFSET(INDIRECT(MID(CELL(\"filename\",Sheet1!$A$15),FIND(\"]\",CELL(\"filename\",Sheet1!$A$15))+1,31)&\"!\"&ADDRESS(MATCH(Sheet5!$D$9,Sheet1!C:C,0)+1,3,4)),ROW(B14)-1+SUM($B$14:$C$14),0))","v":2052},{"$f":"IF(ROW(B14)-1>=$E$14,\"\",OFFSET(INDIRECT(MID(CELL(\"filename\",Sheet1!$A$15),FIND(\"]\",CELL(\"filename\",Sheet1!$A$15))+1,31)&\"!\"&ADDRESS(MATCH(Sheet5!$D$9,Sheet1!C:C,0)+1,3,4)),ROW(B14)-1+SUM($B$14:$D$14),0))","v":""},1]
[null,{"$f":"IF(ROW(B15)-1>=$B$14,\"\",OFFSET(INDIRECT(MID(CELL(\"filename\",Sheet1!$A$15),FIND(\"]\",CELL(\"filename\",Sheet1!$A$15))+1,31)&\"!\"&ADDRESS(MATCH(Sheet5!$D$9,Sheet1!C:C,0)+1,3,4)),ROW(B15)-1,0))","v":""},{"$f":"IF(ROW(B15)-1>=$C$14,\"\",OFFSET(INDIRECT(MID(CELL(\"filename\",Sheet1!$A$15),FIND(\"]\",CELL(\"filename\",Sheet1!$A$15))+1,31)&\"!\"&ADDRESS(MATCH(Sheet5!$D$9,Sheet1!C:C,0)+1,3,4)),ROW(B15)-1+SUM($B$14:$B$14),0))","v":148},{"$f":"IF(ROW(B15)-1>=$D$14,\"\",OFFSET(INDIRECT(MID(CELL(\"filename\",Sheet1!$A$15),FIND(\"]\",CELL(\"filename\",Sheet1!$A$15))+1,31)&\"!\"&ADDRESS(MATCH(Sheet5!$D$9,Sheet1!C:C,0)+1,3,4)),ROW(B15)-1+SUM($B$14:$C$14),0))","v":153},{"$f":"IF(ROW(B15)-1>=$E$14,\"\",OFFSET(INDIRECT(MID(CELL(\"filename\",Sheet1!$A$15),FIND(\"]\",CELL(\"filename\",Sheet1!$A$15))+1,31)&\"!\"&ADDRESS(MATCH(Sheet5!$D$9,Sheet1!C:C,0)+1,3,4)),ROW(B15)-1+SUM($B$14:$D$14),0))","v":""},1]
[null,{"$f":"IF(ROW(B16)-1>=$B$14,\"\",OFFSET(INDIRECT(MID(CELL(\"filename\",Sheet1!$A$15),FIND(\"]\",CELL(\"filename\",Sheet1!$A$15))+1,31)&\"!\"&ADDRESS(MATCH(Sheet5!$D$9,Sheet1!C:C,0)+1,3,4)),ROW(B16)-1,0))","v":""},{"$f":"IF(ROW(B16)-1>=$C$14,\"\",OFFSET(INDIRECT(MID(CELL(\"filename\",Sheet1!$A$15),FIND(\"]\",CELL(\"filename\",Sheet1!$A$15))+1,31)&\"!\"&ADDRESS(MATCH(Sheet5!$D$9,Sheet1!C:C,0)+1,3,4)),ROW(B16)-1+SUM($B$14:$B$14),0))","v":""},{"$f":"IF(ROW(B16)-1>=$D$14,\"\",OFFSET(INDIRECT(MID(CELL(\"filename\",Sheet1!$A$15),FIND(\"]\",CELL(\"filename\",Sheet1!$A$15))+1,31)&\"!\"&ADDRESS(MATCH(Sheet5!$D$9,Sheet1!C:C,0)+1,3,4)),ROW(B16)-1+SUM($B$14:$C$14),0))","v":1053},{"$f":"IF(ROW(B16)-1>=$E$14,\"\",OFFSET(INDIRECT(MID(CELL(\"filename\",Sheet1!$A$15),FIND(\"]\",CELL(\"filename\",Sheet1!$A$15))+1,31)&\"!\"&ADDRESS(MATCH(Sheet5!$D$9,Sheet1!C:C,0)+1,3,4)),ROW(B16)-1+SUM($B$14:$D$14),0))","v":""},1]
[null,{"$f":"IF(ROW(B17)-1>=$B$14,\"\",OFFSET(INDIRECT(MID(CELL(\"filename\",Sheet1!$A$15),FIND(\"]\",CELL(\"filename\",Sheet1!$A$15))+1,31)&\"!\"&ADDRESS(MATCH(Sheet5!$D$9,Sheet1!C:C,0)+1,3,4)),ROW(B17)-1,0))","v":""},{"$f":"IF(ROW(B17)-1>=$C$14,\"\",OFFSET(INDIRECT(MID(CELL(\"filename\",Sheet1!$A$15),FIND(\"]\",CELL(\"filename\",Sheet1!$A$15))+1,31)&\"!\"&ADDRESS(MATCH(Sheet5!$D$9,Sheet1!C:C,0)+1,3,4)),ROW(B17)-1+SUM($B$14:$B$14),0))","v":""},{"$f":"IF(ROW(B17)-1>=$D$14,\"\",OFFSET(INDIRECT(MID(CELL(\"filename\",Sheet1!$A$15),FIND(\"]\",CELL(\"filename\",Sheet1!$A$15))+1,31)&\"!\"&ADDRESS(MATCH(Sheet5!$D$9,Sheet1!C:C,0)+1,3,4)),ROW(B17)-1+SUM($B$14:$C$14),0))","v":2053},{"$f":"IF(ROW(B17)-1>=$E$14,\"\",OFFSET(INDIRECT(MID(CELL(\"filename\",Sheet1!$A$15),FIND(\"]\",CELL(\"filename\",Sheet1!$A$15))+1,31)&\"!\"&ADDRESS(MATCH(Sheet5!$D$9,Sheet1!C:C,0)+1,3,4)),ROW(B17)-1+SUM($B$14:$D$14),0))","v":""},1]
[null,{"$f":"IF(ROW(B18)-1>=$B$14,\"\",OFFSET(INDIRECT(MID(CELL(\"filename\",Sheet1!$A$15),FIND(\"]\",CELL(\"filename\",Sheet1!$A$15))+1,31)&\"!\"&ADDRESS(MATCH(Sheet5!$D$9,Sheet1!C:C,0)+1,3,4)),ROW(B18)-1,0))","v":""},{"$f":"IF(ROW(B18)-1>=$C$14,\"\",OFFSET(INDIRECT(MID(CELL(\"filename\",Sheet1!$A$15),FIND(\"]\",CELL(\"filename\",Sheet1!$A$15))+1,31)&\"!\"&ADDRESS(MATCH(Sheet5!$D$9,Sheet1!C:C,0)+1,3,4)),ROW(B18)-1+SUM($B$14:$B$14),0))","v":""},{"$f":"IF(ROW(B18)-1>=$D$14,\"\",OFFSET(INDIRECT(MID(CELL(\"filename\",Sheet1!$A$15),FIND(\"]\",CELL(\"filename\",Sheet1!$A$15))+1,31)&\"!\"&ADDRESS(MATCH(Sheet5!$D$9,Sheet1!C:C,0)+1,3,4)),ROW(B18)-1+SUM($B$14:$C$14),0))","v":154},{"$f":"IF(ROW(B18)-1>=$E$14,\"\",OFFSET(INDIRECT(MID(CELL(\"filename\",Sheet1!$A$15),FIND(\"]\",CELL(\"filename\",Sheet1!$A$15))+1,31)&\"!\"&ADDRESS(MATCH(Sheet5!$D$9,Sheet1!C:C,0)+1,3,4)),ROW(B18)-1+SUM($B$14:$D$14),0))","v":""},1]
[null,{"$f":"IF(ROW(B19)-1>=$B$14,\"\",OFFSET(INDIRECT(MID(CELL(\"filename\",Sheet1!$A$15),FIND(\"]\",CELL(\"filename\",Sheet1!$A$15))+1,31)&\"!\"&ADDRESS(MATCH(Sheet5!$D$9,Sheet1!C:C,0)+1,3,4)),ROW(B19)-1,0))","v":""},{"$f":"IF(ROW(B19)-1>=$C$14,\"\",OFFSET(INDIRECT(MID(CELL(\"filename\",Sheet1!$A$15),FIND(\"]\",CELL(\"filename\",Sheet1!$A$15))+1,31)&\"!\"&ADDRESS(MATCH(Sheet5!$D$9,Sheet1!C:C,0)+1,3,4)),ROW(B19)-1+SUM($B$14:$B$14),0))","v":""},{"$f":"IF(ROW(B19)-1>=$D$14,\"\",OFFSET(INDIRECT(MID(CELL(\"filename\",Sheet1!$A$15),FIND(\"]\",CELL(\"filename\",Sheet1!$A$15))+1,31)&\"!\"&ADDRESS(MATCH(Sheet5!$D$9,Sheet1!C:C,0)+1,3,4)),ROW(B19)-1+SUM($B$14:$C$14),0))","v":1054},{"$f":"IF(ROW(B19)-1>=$E$14,\"\",OFFSET(INDIRECT(MID(CELL(\"filename\",Sheet1!$A$15),FIND(\"]\",CELL(\"filename\",Sheet1!$A$15))+1,31)&\"!\"&ADDRESS(MATCH(Sheet5!$D$9,Sheet1!C:C,0)+1,3,4)),ROW(B19)-1+SUM($B$14:$D$14),0))","v":""},1]
[null,{"$f":"IF(ROW(B20)-1>=$B$14,\"\",OFFSET(INDIRECT(MID(CELL(\"filename\",Sheet1!$A$15),FIND(\"]\",CELL(\"filename\",Sheet1!$A$15))+1,31)&\"!\"&ADDRESS(MATCH(Sheet5!$D$9,Sheet1!C:C,0)+1,3,4)),ROW(B20)-1,0))","v":""},{"$f":"IF(ROW(B20)-1>=$C$14,\"\",OFFSET(INDIRECT(MID(CELL(\"filename\",Sheet1!$A$15),FIND(\"]\",CELL(\"filename\",Sheet1!$A$15))+1,31)&\"!\"&ADDRESS(MATCH(Sheet5!$D$9,Sheet1!C:C,0)+1,3,4)),ROW(B20)-1+SUM($B$14:$B$14),0))","v":""},{"$f":"IF(ROW(B20)-1>=$D$14,\"\",OFFSET(INDIRECT(MID(CELL(\"filename\",Sheet1!$A$15),FIND(\"]\",CELL(\"filename\",Sheet1!$A$15))+1,31)&\"!\"&ADDRESS(MATCH(Sheet5!$D$9,Sheet1!C:C,0)+1,3,4)),ROW(B20)-1+SUM($B$14:$C$14),0))","v":2054},{"$f":"IF(ROW(B20)-1>=$E$14,\"\",OFFSET(INDIRECT(MID(CELL(\"filename\",Sheet1!$A$15),FIND(\"]\",CELL(\"filename\",Sheet1!$A$15))+1,31)&\"!\"&ADDRESS(MATCH(Sheet5!$D$9,Sheet1!C:C,0)+1,3,4)),ROW(B20)-1+SUM($B$14:$D$14),0))","v":""},1]
[]
[null,"परीक्षा प्रभारी",null,null,"केन्द्राधीक्षक "]
[null,{"$f":"Sheet2!$B$37","v":"XYZ (Lecturer)"},null,null,{"$f":"Sheet2!$E$37","v":"XYZ (Principal)"}]

{"sheet":"Sheet7","index":6,"n_rows":37,"n_cols":6,"rows_kept":37,"merged":[[0,1,0,4],[1,1,1,4],[2,1,2,4],[3,1,3,4],[4,1,4,4],[5,1,5,4],[7,1,7,4],[8,1,8,2],[8,3,8,4],[9,1,9,4],[10,1,10,4],[11,1,11,4]]}
[null,{"$f":"Sheet2!$B$1","v":"Half Yearly Examination 2024"}]
[null,"परीक्षा केंद्र नाम एवं परीक्षा केंद्र क्रमांक"]
[null,{"$f":"Sheet2!$B$3","v":"Govt Sr Sc School Malutana (216405)"}]
[null,"परीक्षा कक्ष / हॉल क्रमांक"]
[null,{"$f":"Sheet2!$K$6","v":{"v":6,"d":"06"}}]
[null,"परीक्षा दिनांक (दिवस) ... से ... तक"]
[null,{"$f":"Sheet2!$B$7","v":"14-12-2024"},{"$f":"IF(B7=\"\",\"\",TEXT(B7,\"DDDD\"))","v":"Saturday"},{"$f":"Sheet2!$D$7","v":"24-12-2024"},{"$f":"IF(D7=\"\",\"\",TEXT(D7,\"DDDD\"))","v":"Tuesday"}]
[null,"परीक्षार्थी रोल नंबर ... से ... तक"]
[null,{"$f":"IF(B14>0,B15,IF(C14>0,C15,IF(D14>0,D15,IF(E14>0,E15,0))))","v":1059},null,{"$f":"IF(E14>0,LOOKUP(2,1/(E15:E34<>\"\"),E15:E34),IF(D14>0,LOOKUP(2,1/(D15:D34<>\"\"),D15:D34),IF(C14>0,LOOKUP(2,1/(C15:C34<>\"\"),C15:C34),IF(B14>0,LOOKUP(2,1/(B15:B34<>\"\"),B15:B34),0))))","v":2082}]
[null,"कुल सम्मिलित परीक्षार्थी "]
[null,{"$f":"COUNTIF($B$15:$E$34,\">0\")","v":70}]
[null,"परीक्षार्थी बैठक व्यवस्था"]
[null,"पंक्ति 1","पंक्ति 2","पंक्ति 3","पंक्ति 4"]
[null,{"$f":"Sheet2!L6","v":21},{"$f":"Sheet2!M6","v":20},{"$f":"Sheet2!N6","v":10},{"$f":"Sheet2!O6","v":20}]
[null,{"$f":"IF(ROW(B1)-1>=$B$14,\"\",OFFSET(INDIRECT(MID(CELL(\"filename\",Sheet1!$A$15),FIND(\"]\",CELL(\"filename\",Sheet1!$A$15))+1,31)&\"!\"&ADDRESS(MATCH(Sheet6!$D$9,Sheet1!C:C,0)+1,3,4)),ROW(B1)-1,0))","v":1059},{"$f":"IF(ROW(B1)-1>=$C$14,\"\",OFFSET(INDIRECT(MID(CELL(\"filename\",Sheet1!$A$15),FIND(\"]\",CELL(\"filename\",Sheet1!$A$15))+1,31)&\"!\"&ADDRESS(MATCH(Sheet6!$D$9,Sheet1!C:C,0)+1,3,4)),ROW(B1)-1+SUM($B$14:$B$14),0))","v":1066},{"$f":"IF(ROW(B1)-1>=$D$14,\"\",OFFSET(INDIRECT(MID(CELL(\"filename\",Sheet1!$A$15),FIND(\"]\",CELL(\"filename\",Sheet1!$A$15))+1,31)&\"!\"&ADDRESS(MATCH(Sheet6!$D$9,Sheet1!C:C,0)+1,3,4)),ROW(B1)-1+SUM($B$14:$C$14),0))","v":173},{"$f":"IF(ROW(B1)-1>=$E$14,\"\",OFFSET(INDIRECT(MID(CELL(\"filename\",Sheet1!$A$15),FIND(\"]\",CELL(\"filename\",Sheet1!$A$15))+1,31)&\"!\"&ADDRESS(MATCH(Sheet6!$D$9,Sheet1!C:C,0)+1,3,4)),ROW(B1)-1+SUM($B$14:$D$14),0))","v":1076},{"$f":"IF(SUM(B15:E15)>0,1,\"\")","v":1}]
[null,{"$f":"IF(ROW(B2)-1>=$B$14,\"\",OFFSET(INDIRECT(MID(CELL(\"filename\",Sheet1!$A$15),FIND(\"]\",CELL(\"filename\",Sheet1!$A$15))+1,31)&\"!\"&ADDRESS(MATCH(Sheet6!$D$9,Sheet1!C:C,0)+1,3,4)),ROW(B2)-1,0))","v":2059},{"$f":"IF(ROW(B2)-1>=$C$14,\"\",OFFSET(INDIRECT(MID(CELL(\"filename\",Sheet1!$A$15),FIND(\"]\",CELL(\"filename\",Sheet1!$A$15))+1,31)&\"!\"&ADDRESS(MATCH(Sheet6!$D$9,Sheet1!C:C,0)+1,3,4)),ROW(B2)-1+SUM($B$14:$B$14),0))","v":2066},{"$f":"IF(ROW(B2)-1>=$D$14,\"\",OFFSET(INDIRECT(MID(CELL(\"filename\",Sheet1!$A$15),FIND(\"]\",CELL(\"filename\",Sheet1!$A$15))+1,31)&\"!\"&ADDRESS(MATCH(Sheet6!$D$9,Sheet1!C:C,0)+1,3,4)),ROW(B2)-1+SUM($B$14:$C$14),0))","v":1073},{"$f":"IF(ROW(B2)-1>=$E$14,\"\",OFFSET(INDIRECT(MID(CELL(\"filename\",Sheet1!$A$15),FIND(\"]\",CELL(\"filename\",Sheet1!$A$15))+1,31)&\"!\"&ADDRESS(MATCH(Sheet6!$D$9,Sheet1!C:C,0)+1,3,4)),ROW(B2)-1+SUM($B$14:$D$14),0))","v":2076},{"$f":"IF(SUM(B16:E16)>0,1,\"\")","v":1}]
[null,{"$f":"IF(ROW(B3)-1>=$B$14,\"\",OFFSET(INDIRECT(MID(CELL(\"filename\",Sheet1!$A$15),FIND(\"]\",CELL(\"filename\",Sheet1!$A$15))+1,31)&\"!\"&ADDRESS(MATCH(Sheet6!$D$9,Sheet1!C:C,0)+1,3,4)),ROW(B3)-1,0))","v":160},{"$f":"IF(ROW(B3)-1>=$C$14,\"\",OFFSET(INDIRECT(MID(CELL(\"filename\",Sheet1!$A$15),FIND(\"]\",CELL(\"filename\",Sheet1!$A$15))+1,31)&\"!\"&ADDRESS(MATCH(Sheet6!$D$9,Sheet1!C:C,0)+1,3,4)),ROW(B3)-1+SUM($B$14:$B$14),0))","v":167},{"$f":"IF(ROW(B3)-1>=$D$14,\"\",OFFSET(INDIRECT(MID(CELL(\"filename\",Sheet1!$A$15),FIND(\"]\",CELL(\"filename\",Sheet1!$A$15))+1,31)&\"!\"&ADDRESS(MATCH(Sheet6!$D$9,Sheet1!C:C,0)+1,3,4)),ROW(B3)-1+SUM($B$14:$C$14),0))","v":2073},{"$f":"IF(ROW(B3)-1>=$E$14,\"\",OFFSET(INDIRECT(MID(CELL(\"filename\",Sheet1!$A$15),FIND(\"]\",CELL(\"filename\",Sheet1!$A$15))+1,31)&\"!\"&ADDRESS(MATCH(Sheet6!$D$9,Sheet1!C:C,0)+1,3,4)),ROW(B3)-1+SUM($B$14:$D$14),0))","v":177},1]
[null,{"$f":"IF(ROW(B4)-1>=$B$14,\"\",OFFSET(INDIRECT(MID(CELL(\"filename\",Sheet1!$A$15),FIND(\"]\",CELL(\"filename\",Sheet1!$A$15))+1,31)&\"!\"&ADDRESS(MATCH(Sheet6!$D$9,Sheet1!C:C,0)+1,3,4)),ROW(B4)-1,0))","v":1060},{"$f":"IF(ROW(B4)-1>=$C$14,\"\",OFFSET(INDIRECT(MID(CELL(\"filename\",Sheet1!$A$15),FIND(\"]\",CELL(\"filename\",Sheet1!$A$15))+1,31)&\"!\"&ADDRESS(MATCH(Sheet6!$D$9,Sheet1!C:C,0)+1,3,4)),ROW(B4)-1+SUM($B$14:$B$14),0))","v":1067},{"$f":"IF(ROW(B4)-1>=$D$14,\"\",OFFSET(INDIRECT(MID(CELL(\"filename\",Sheet1!$A$15),FIND(\"]\",CELL(\"filename\",Sheet1!$A$15))+1,31)&\"!\"&ADDRESS(MATCH(Sheet6!$D$9,Sheet1!C:C,0)+1,3,4)),ROW(B4)-1+SUM($B$14:$C$14),0))","v":174},{"$f":"IF(ROW(B4)-1>=$E$14,\"\",OFFSET(INDIRECT(MID(CELL(\"filename\",Sheet1!$A$15),FIND(\"]\",CELL(\"filename\",Sheet1!$A$15))+1,31)&\"!\"&ADDRESS(MATCH(Sheet6!$D$9,Sheet1!C:C,0)+1,3,4)),ROW(B4)-1+SUM($B$14:$D$14),0))","v":1077},1]
[null,{"$f":"IF(ROW(B5)-1>=$B$14,\"\",OFFSET(INDIRECT(MID(CELL(\"filename\",Sheet1!$A$15),FIND(\"]\",CELL(\"filename\",Sheet1!$A$15))+1,31)&\"!\"&ADDRESS(MATCH(Sheet6!$D$9,Sheet1!C:C,0)+1,3,4)),ROW(B5)-1,0))","v":2060},{"$f":"IF(ROW(B5)-1>=$C$14,\"\",OFFSET(INDIRECT(MID(CELL(\"filename\",Sheet1!$A$15),FIND(\"]\",CELL(\"filename\",Sheet1!$A$15))+1,31)&\"!\"&ADDRESS(MATCH(Sheet6!$D$9,Sheet1!C:C,0)+1,3,4)),ROW(B5)-1+SUM($B$14:$B$14),0))","v":2067},{"$f":"IF(ROW(B5)-1>=$D$14,\"\",OFFSET(INDIRECT(MID(CELL(\"filename\",Sheet1!$A$15),FIND(\"]\",CELL(\"filename\",Sheet1!$A$15))+1,31)&\"!\"&ADDRESS(MATCH(Sheet6!$D$9,Sheet1!C:C,0)+1,3,4)),ROW(B5)-1+SUM($B$14:$C$14),0))","v":1074},{"$f":"IF(ROW(B5)-1>=$E$14,\"\",OFFSET(INDIRECT(MID(CELL(\"filename\",Sheet1!$A$15),FIND(\"]\",CELL(\"filename\",Sheet1!$A$15))+1,31)&\"!\"&ADDRESS(MATCH(Sheet6!$D$9,Sheet1!C:C,0)+1,3,4)),ROW(B5)-1+SUM($B$14:$D$14),0))","v":2077},1]
[null,{"$f":"IF(ROW(B6)-1>=$B$14,\"\",OFFSET(INDIRECT(MID(CELL(\"filename\",Sheet1!$A$15),FIND(\"]\",CELL(\"filename\",Sheet1!$A$15))+1,31)&\"!\"&ADDRESS(MATCH(Sheet6!$D$9,Sheet1!C:C,0)+1,3,4)),ROW(B6)-1,0))","v":161},{"$f":"IF(ROW(B6)-1>=$C$14,\"\",OFFSET(INDIRECT(MID(CELL(\"filename\",Sheet1!$A$15),FIND(\"]\",CELL(\"filename\",Sheet1!$A$15))+1,31)&\"!\"&ADDRESS(MATCH(Sheet6!$D$9,Sheet1!C:C,0)+1,3,4)),ROW(B6)-1+SUM($B$14:$B$14),0))","v":168},{"$f":"IF(ROW(B6)-1>=$D$14,\"\",OFFSET(INDIRECT(MID(CELL(\"filename\",Sheet1!$A$15),FIND(\"]\",CELL(\"filename\",Sheet1!$A$15))+1,31)&\"!\"&ADDRESS(MATCH(Sheet6!$D$9,Sheet1!C:C,0)+1,3,4)),ROW(B6)-1+SUM($B$14:$C$14),0))","v":2074},{"$f":"IF(ROW(B6)-1>=$E$14,\"\",OFFSET(INDIRECT(MID(CELL(\"filename\",Sheet1!$A$15),FIND(\"]\",CELL(\"filename\",Sheet1!$A$15))+1,31)&\"!\"&ADDRESS(MATCH(Sheet6!$D$9,Sheet1!C:C,0)+1,3,4)),ROW(B6)-1+SUM($B$14:$D$14),0))","v":178},1]
[null,{"$f":"IF(ROW(B7)-1>=$B$14,\"\",OFFSET(INDIRECT(MID(CELL(\"filename\",Sheet1!$A$15),FIND(\"]\",CELL(\"filename\",Sheet1!$A$15))+1,31)&\"!\"&ADDRESS(MATCH(Sheet6!$D$9,Sheet1!C:C,0)+1,3,4)),ROW(B7)-1,0))","v":1061},{"$f":"IF(ROW(B7)-1>=$C$14,\"\",OFFSET(INDIRECT(MID(CELL(\"filename\",Sheet1!$A$15),FIND(\"]\",CELL(\"filename\",Sheet1!$A$15))+1,31)&\"!\"&ADDRESS(MATCH(Sheet6!$D$9,Sheet1!C:C,0)+1,3,4)),ROW(B7)-1+SUM($B$14:$B$14),0))","v":1068},{"$f":"IF(ROW(B7)-1>=$D$14,\"\",OFFSET(INDIRECT(MID(CELL(\"filename\",Sheet1!$A$15),FIND(\"]\",CELL(\"filename\",Sheet1!$A$15))+1,31)&\"!\"&ADDRESS(MATCH(Sheet6!$D$9,Sheet1!C:C,0)+1,3,4)),ROW(B7)-1+SUM($B$14:$C$14),0))","v":175},{"$f":"IF(ROW(B7)-1>=$E$14,\"\",OFFSET(INDIRECT(MID(CELL(\"filename\",Sheet1!$A$15),FIND(\"]\",CELL(\"filename\",Sheet1!$A$15))+1,31)&\"!\"&ADDRESS(MATCH(Sheet6!$D$9,Sheet1!C:C,0)+1,3,4)),ROW(B7)-1+SUM($B$14:$D$14),0))","v":1078},1]
[null,{"$f":"IF(ROW(B8)-1>=$B$14,\"\",OFFSET(INDIRECT(MID(CELL(\"filename\",Sheet1!$A$15),FIND(\"]\",CELL(\"filename\",Sheet1!$A$15))+1,31)&\"!\"&ADDRESS(MATCH(Sheet6!$D$9,Sheet1!C:C,0)+1,3,4)),ROW(B8)-1,0))","v":2061},{"$f":"IF(ROW(B8)-1>=$C$14,\"\",OFFSET(INDIRECT(MID(CELL(\"filename\",Sheet1!$A$15),FIND(\"]\",CELL(\"filename\",Sheet1!$A$15))+1,31)&\"!\"&ADDRESS(MATCH(Sheet6!$D$9,Sheet1!C:C,0)+1,3,4)),ROW(B8)-1+SUM($B$14:$B$14),0))","v":2068},{"$f":"IF(ROW(B8)-1>=$D$14,\"\",OFFSET(INDIRECT(MID(CELL(\"filename\",Sheet1!$A$15),FIND(\"]\",CELL(\"filename\",Sheet1!$A$15))+1,31)&\"!\"&ADDRESS(MATCH(Sheet6!$D$9,Sheet1!C:C,0)+1,3,4)),ROW(B8)-1+SUM($B$14:$C$14),0))","v":1075},{"$f":"IF(ROW(B8)-1>=$E$14,\"\",OFFSET(INDIRECT(MID(CELL(\"filename\",Sheet1!$A$15),FIND(\"]\",CELL(\"filename\",Sheet1!$A$15))+1,31)&\"!\"&ADDRESS(MATCH(Sheet6!$D$9,Sheet1!C:C,0)+1,3,4)),ROW(B8)-1+SUM($B$14:$D$14),0))","v":2078},1]
[null,{"$f":"IF(ROW(B9)-1>=$B$14,\"\",OFFSET(INDIRECT(MID(CELL(\"filename\",Sheet1!$A$15),FIND(\"]\",CELL(\"filename\",Sheet1!$A$15))+1,31)&\"!\"&ADDRESS(MATCH(Sheet6!$D$9,Sheet1!C:C,0)+1,3,4)),ROW(B9)-1,0))","v":162},{"$f":"IF(ROW(B9)-1>=$C$14,\"\",OFFSET(INDIRECT(MID(CELL(\"filename\",Sheet1!$A$15),FIND(\"]\",CELL(\"filename\",Sheet1!$A$15))+1,31)&\"!\"&ADDRESS(MATCH(Sheet6!$D$9,Sheet1!C:C,0)+1,3,4)),ROW(B9)-1+SUM($B$14:$B$14),0))","v":169},{"$f":"IF(ROW(B9)-1>=$D$14,\"\",OFFSET(INDIRECT(MID(CELL(\"filename\",Sheet1!$A$15),FIND(\"]\",CELL(\"filename\",Sheet1!$A$15))+1,31)&\"!\"&ADDRESS(MATCH(Sheet6!$D$9,Sheet1!C:C,0)+1,3,4)),ROW(B9)-1+SUM($B$14:$C$14),0))","v":2075},{"$f":"IF(ROW(B9)-1>=$E$14,\"\",OFFSET(INDIRECT(MID(CELL(\"filename\",Sheet1!$A$15),FIND(\"]\",CELL(\"filename\",Sheet1!$A$15))+1,31)&\"!\"&ADDRESS(MATCH(Sheet6!$D$9,Sheet1!C:C,0)+1,3,4)),ROW(B9)-1+SUM($B$14:$D$14),0))","v":179},1]
[null,{"$f":"IF(ROW(B10)-1>=$B$14,\"\",OFFSET(INDIRECT(MID(CELL(\"filename\",Sheet1!$A$15),FIND(\"]\",CELL(\"filename\",Sheet1!$A$15))+1,31)&\"!\"&ADDRESS(MATCH(Sheet6!$D$9,Sheet1!C:C,0)+1,3,4)),ROW(B10)-1,0))","v":1062},{"$f":"IF(ROW(B10)-1>=$C$14,\"\",OFFSET(INDIRECT(MID(CELL(\"filename\",Sheet1!$A$15),FIND(\"]\",CELL(\"filename\",Sheet1!$A$15))+1,31)&\"!\"&ADDRESS(MATCH(Sheet6!$D$9,Sheet1!C:C,0)+1,3,4)),ROW(B10)-1+SUM($B$14:$B$14),0))","v":1069},{"$f":"IF(ROW(B10)-1>=$D$14,\"\",OFFSET(INDIRECT(MID(CELL(\"filename\",Sheet1!$A$15),FIND(\"]\",CELL(\"filename\",Sheet1!$A$15))+1,31)&\"!\"&ADDRESS(MATCH(Sheet6!$D$9,Sheet1!C:C,0)+1,3,4)),ROW(B10)-1+SUM($B$14:$C$14),0))","v":176},{"$f":"IF(ROW(B10)-1>=$E$14,\"\",OFFSET(INDIRECT(MID(CELL(\"filename\",Sheet1!$A$15),FIND(\"]\",CELL(\"filename\",Sheet1!$A$15))+1,31)&\"!\"&ADDRESS(MATCH(Sheet6!$D$9,Sheet1!C:C,0)+1,3,4)),ROW(B10)-1+SUM($B$14:$D$14),0))","v":1079},1]
[null,{"$f":"IF(ROW(B11)-1>=$B$14,\"\",OFFSET(INDIRECT(MID(CELL(\"filename\",Sheet1!$A$15),FIND(\"]\",CELL(\"filename\",Sheet1!$A$15))+1,31)&\"!\"&ADDRESS(MATCH(Sheet6!$D$9,Sheet1!C:C,0)+1,3,4)),ROW(B11)-1,0))","v":2062},{"$f":"IF(ROW(B11)-1>=$C$14,\"\",OFFSET(INDIRECT(MID(CELL(\"filename\",Sheet1!$A$15),FIND(\"]\",CELL(\"filename\",Sheet1!$A$15))+1,31)&\"!\"&ADDRESS(MATCH(Sheet6!$D$9,Sheet1!C:C,0)+1,3,4)),ROW(B11)-1+SUM($B$14:$B$14),0))","v":2069},{"$f":"IF(ROW(B11)-1>=$D$14,\"\",OFFSET(INDIRECT(MID(CELL(\"filename\",Sheet1!$A$15),FIND(\"]\",CELL(\"filename\",Sheet1!$A$15))+1,31)&\"!\"&ADDRESS(MATCH(Sheet6!$D$9,Sheet1!C:C,0)+1,3,4)),ROW(B11)-1+SUM($B$14:$C$14),0))","v":""},{"$f":"IF(ROW(B11)-1>=$E$14,\"\",OFFSET(INDIRECT(MID(CELL(\"filename\",Sheet1!$A$15),FIND(\"]\",CELL(\"filename\",Sheet1!$A$15))+1,31)&\"!\"&ADDRESS(MATCH(Sheet6!$D$9,Sheet1!C:C,0)+1,3,4)),ROW(B11)-1+SUM($B$14:$D$14),0))","v":2079},1]
[null,{"$f":"IF(ROW(B12)-1>=$B$14,\"\",OFFSET(INDIRECT(MID(CELL(\"filename\",Sheet1!$A$15),FIND(\"]\",CELL(\"filename\",Sheet1!$A$15))+1,31)&\"!\"&ADDRESS(MATCH(Sheet6!$D$9,Sheet1!C:C,0)+1,3,4)),ROW(B12)-1,0))","v":163},{"$f":"IF(ROW(B12)-1>=$C$14,\"\",OFFSET(INDIRECT(MID(CELL(\"filename\",Sheet1!$A$15),FIND(\"]\",CELL(\"filename\",Sheet1!$A$15))+1,31)&\"!\"&ADDRESS(MATCH(Sheet6!$D$9,Sheet1!C:C,0)+1,3,4)),ROW(B12)-1+SUM($B$14:$B$14),0))","v":170},{"$f":"IF(ROW(B12)-1>=$D$14,\"\",OFFSET(INDIRECT(MID(CELL(\"filename\",Sheet1!$A$15),FIND(\"]\",CELL(\"filename\",Sheet1!$A$15))+1,31)&\"!\"&ADDRESS(MATCH(Sheet6!$D$9,Sheet1!C:C,0)+1,3,4)),ROW(B12)-1+SUM($B$14:$C$14),0))","v":""},{"$f":"IF(ROW(B12)-1>=$E$14,\"\",OFFSET(INDIRECT(MID(CELL(\"filename\",Sheet1!$A$15),FIND(\"]\",CELL(\"filename\",Sheet1!$A$15))+1,31)&\"!\"&ADDRESS(MATCH(Sheet6!$D$9,Sheet1!C:C,0)+1,3,4)),ROW(B12)-1+SUM($B$14:$D$14),0))","v":180},1]
[null,{"$f":"IF(ROW(B13)-1>=$B$14,\"\",OFFSET(INDIRECT(MID(CELL(\"filename\",Sheet1!$A$15),FIND(\"]\",CELL(\"filename\",Sheet1!$A$15))+1,31)&\"!\"&ADDRESS(MATCH(Sheet6!$D$9,Sheet1!C:C,0)+1,3,4)),ROW(B13)-1,0))","v":1063},{"$f":"IF(ROW(B13)-1>=$C$14,\"\",OFFSET(INDIRECT(MID(CELL(\"filename\",Sheet1!$A$15),FIND(\"]\",CELL(\"filename\",Sheet1!$A$15))+1,31)&\"!\"&ADDRESS(MATCH(Sheet6!$D$9,Sheet1!C:C,0)+1,3,4)),ROW(B13)-1+SUM($B$14:$B$14),0))","v":1070},{"$f":"IF(ROW(B13)-1>=$D$14,\"\",OFFSET(INDIRECT(MID(CELL(\"filename\",Sheet1!$A$15),FIND(\"]\",CELL(\"filename\",Sheet1!$A$15))+1,31)&\"!\"&ADDRESS(MATCH(Sheet6!$D$9,Sheet1!C:C,0)+1,3,4)),ROW(B13)-1+SUM($B$14:$C$14),0))","v":""},{"$f":"IF(ROW(B13)-1>=$E$14,\"\",OFFSET(INDIRECT(MID(CELL(\"filename\",Sheet1!$A$15),FIND(\"]\",CELL(\"filename\",Sheet1!$A$15))+1,31)&\"!\"&ADDRESS(MATCH(Sheet6!$D$9,Sheet1!C:C,0)+1,3,4)),ROW(B13)-1+SUM($B$14:$D$14),0))","v":1080},1]
[null,{"$f":"IF(ROW(B14)-1>=$B$14,\"\",OFFSET(INDIRECT(MID(CELL(\"filename\",Sheet1!$A$15),FIND(\"]\",CELL(\"filename\",Sheet1!$A$15))+1,31)&\"!\"&ADDRESS(MATCH(Sheet6!$D$9,Sheet1!C:C,0)+1,3,4)),ROW(B14)-1,0))","v":2063},{"$f":"IF(ROW(B14)-1>=$C$14,\"\",OFFSET(INDIRECT(MID(CELL(\"filename\",Sheet1!$A$15),FIND(\"]\",CELL(\"filename\",Sheet1!$A$15))+1,31)&\"!\"&ADDRESS(MATCH(Sheet6!$D$9,Sheet1!C:C,0)+1,3,4)),ROW(B14)-1+SUM($B$14:$B$14),0))","v":2070},{"$f":"IF(ROW(B14)-1>=$D$14,\"\",OFFSET(INDIRECT(MID(CELL(\"filename\",Sheet1!$A$15),FIND(\"]\",CELL(\"filename\",Sheet1!$A$15))+1,31)&\"!\"&ADDRESS(MATCH(Sheet6!$D$9,Sheet1!C:C,0)+1,3,4)),ROW(B14)-1+SUM($B$14:$C$14),0))","v":""},{"$f":"IF(ROW(B14)-1>=$E$14,\"\",OFFSET(INDIRECT(MID(CELL(\"filename\",Sheet1!$A$15),FIND(\"]\",CELL(\"filename\",Sheet1!$A$15))+1,31)&\"!\"&ADDRESS(MATCH(Sheet6!$D$9,Sheet1!C:C,0)+1,3,4)),ROW(B14)-1+SUM($B$14:$D$14),0))","v":2080},1]
[null,{"$f":"IF(ROW(B15)-1>=$B$14,\"\",OFFSET(INDIRECT(MID(CELL(\"filename\",Sheet1!$A$15),FIND(\"]\",CELL(\"filename\",Sheet1!$A$15))+1,31)&\"!\"&ADDRESS(MATCH(Sheet6!$D$9,Sheet1!C:C,0)+1,3,4)),ROW(B15)-1,0))","v":164},{"$f":"IF(ROW(B15)-1>=$C$14,\"\",OFFSET(INDIRECT(MID(CELL(\"filename\",Sheet1!$A$15),FIND(\"]\",CELL(\"filename\",Sheet1!$A$15))+1,31)&\"!\"&ADDRESS(MATCH(Sheet6!$D$9,Sheet1!C:C,0)+1,3,4)),ROW(B15)-1+SUM($B$14:$B$14),0))","v":171},{"$f":"IF(ROW(B15)-1>=$D$14,\"\",OFFSET(INDIRECT(MID(CELL(\"filename\",Sheet1!$A$15),FIND(\"]\",CELL(\"filename\",Sheet1!$A$15))+1,31)&\"!\"&ADDRESS(MATCH(Sheet6!$D$9,Sheet1!C:C,0)+1,3,4)),ROW(B15)-1+SUM($B$14:$C$14),0))","v":""},{"$f":"IF(ROW(B15)-1>=$E$14,\"\",OFFSET(INDIRECT(MID(CELL(\"filename\",Sheet1!$A$15),FIND(\"]\",CELL(\"filename\",Sheet1!$A$15))+1,31)&\"!\"&ADDRESS(MATCH(Sheet6!$D$9,Sheet1!C:C,0)+1,3,4)),ROW(B15)-1+SUM($B$14:$D$14),0))","v":181},1]
[null,{"$f":"IF(ROW(B16)-1>=$B$14,\"\",OFFSET(INDIRECT(MID(CELL(\"filename\",Sheet1!$A$15),FIND(\"]\",CELL(\"filename\",Sheet1!$A$15))+1,31)&\"!\"&ADDRESS(MATCH(Sheet6!$D$9,Sheet1!C:C,0)+1,3,4)),ROW(B16)-1,0))","v":1064},{"$f":"IF(ROW(B16)-1>=$C$14,\"\",OFFSET(INDIRECT(MID(CELL(\"filename\",Sheet1!$A$15),FIND(\"]\",CELL(\"filename\",Sheet1!$A$15))+1,31)&\"!\"&ADDRESS(MATCH(Sheet6!$D$9,Sheet1!C:C,0)+1,3,4)),ROW(B16)-1+SUM($B$14:$B$14),0))","v":1071},{"$f":"IF(ROW(B16)-1>=$D$14,\"\",OFFSET(INDIRECT(MID(CELL(\"filename\",Sheet1!$A$15),FIND(\"]\",CELL(\"filename\",Sheet1!$A$15))+1,31)&\"!\"&ADDRESS(MATCH(Sheet6!$D$9,Sheet1!C:C,0)+1,3,4)),ROW(B16)-1+SUM($B$14:$C$14),0))","v":""},{"$f":"IF(ROW(B16)-1>=$E$14,\"\",OFFSET(INDIRECT(MID(CELL(\"filename\",Sheet1!$A$15),FIND(\"]\",CELL(\"filename\",Sheet1!$A$15))+1,31)&\"!\"&ADDRESS(MATCH(Sheet6!$D$9,Sheet1!C:C,0)+1,3,4)),ROW(B16)-1+SUM($B$14:$D$14),0))","v":1081},1]
[null,{"$f":"IF(ROW(B17)-1>=$B$14,\"\",OFFSET(INDIRECT(MID(CELL(\"filename\",Sheet1!$A$15),FIND(\"]\",CELL(\"filename\",Sheet1!$A$15))+1,31)&\"!\"&ADDRESS(MATCH(Sheet6!$D$9,Sheet1!C:C,0)+1,3,4)),ROW(B17)-1,0))","v":2064},{"$f":"IF(ROW(B17)-1>=$C$14,\"\",OFFSET(INDIRECT(MID(CELL(\"filename\",Sheet1!$A$15),FIND(\"]\",CELL(\"filename\",Sheet1!$A$15))+1,31)&\"!\"&ADDRESS(MATCH(Sheet6!$D$9,Sheet1!C:C,0)+1,3,4)),ROW(B17)-1+SUM($B$14:$B$14),0))","v":2071},{"$f":"IF(ROW(B17)-1>=$D$14,\"\",OFFSET(INDIRECT(MID(CELL(\"filename\",Sheet1!$A$15),FIND(\"]\",CELL(\"filename\",Sheet1!$A$15))+1,31)&\"!\"&ADDRESS(MATCH(Sheet6!$D$9,Sheet1!C:C,0)+1,3,4)),ROW(B17)-1+SUM($B$14:$C$14),0))","v":""},{"$f":"IF(ROW(B17)-1>=$E$14,\"\",OFFSET(INDIRECT(MID(CELL(\"filename\",Sheet1!$A$15),FIND(\"]\",CELL(\"filename\",Sheet1!$A$15))+1,31)&\"!\"&ADDRESS(MATCH(Sheet6!$D$9,Sheet1!C:C,0)+1,3,4)),ROW(B17)-1+SUM($B$14:$D$14),0))","v":2081},1]
[null,{"$f":"IF(ROW(B18)-1>=$B$14,\"\",OFFSET(INDIRECT(MID(CELL(\"filename\",Sheet1!$A$15),FIND(\"]\",CELL(\"filename\",Sheet1!$A$15))+1,31)&\"!\"&ADDRESS(MATCH(Sheet6!$D$9,Sheet1!C:C,0)+1,3,4)),ROW(B18)-1,0))","v":165},{"$f":"IF(ROW(B18)-1>=$C$14,\"\",OFFSET(INDIRECT(MID(CELL(\"filename\",Sheet1!$A$15),FIND(\"]\",CELL(\"filename\",Sheet1!$A$15))+1,31)&\"!\"&ADDRESS(MATCH(Sheet6!$D$9,Sheet1!C:C,0)+1,3,4)),ROW(B18)-1+SUM($B$14:$B$14),0))","v":172},{"$f":"IF(ROW(B18)-1>=$D$14,\"\",OFFSET(INDIRECT(MID(CELL(\"filename\",Sheet1!$A$15),FIND(\"]\",CELL(\"filename\",Sheet1!$A$15))+1,31)&\"!\"&ADDRESS(MATCH(Sheet6!$D$9,Sheet1!C:C,0)+1,3,4)),ROW(B18)-1+SUM($B$14:$C$14),0))","v":""},{"$f":"IF(ROW(B18)-1>=$E$14,\"\",OFFSET(INDIRECT(MID(CELL(\"filename\",Sheet1!$A$15),FIND(\"]\",CELL(\"filename\",Sheet1!$A$15))+1,31)&\"!\"&ADDRESS(MATCH(Sheet6!$D$9,Sheet1!C:C,0)+1,3,4)),ROW(B18)-1+SUM($B$14:$D$14),0))","v":182},1]
[null,{"$f":"IF(ROW(B19)-1>=$B$14,\"\",OFFSET(INDIRECT(MID(CELL(\"filename\",Sheet1!$A$15),FIND(\"]\",CELL(\"filename\",Sheet1!$A$15))+1,31)&\"!\"&ADDRESS(MATCH(Sheet6!$D$9,Sheet1!C:C,0)+1,3,4)),ROW(B19)-1,0))","v":1065},{"$f":"IF(ROW(B19)-1>=$C$14,\"\",OFFSET(INDIRECT(MID(CELL(\"filename\",Sheet1!$A$15),FIND(\"]\",CELL(\"filename\",Sheet1!$A$15))+1,31)&\"!\"&ADDRESS(MATCH(Sheet6!$D$9,Sheet1!C:C,0)+1,3,4)),ROW(B19)-1+SUM($B$14:$B$14),0))","v":1072},{"$f":"IF(ROW(B19)-1>=$D$14,\"\",OFFSET(INDIRECT(MID(CELL(\"filename\",Sheet1!$A$15),FIND(\"]\",CELL(\"filename\",Sheet1!$A$15))+1,31)&\"!\"&ADDRESS(MATCH(Sheet6!$D$9,Sheet1!C:C,0)+1,3,4)),ROW(B19)-1+SUM($B$14:$C$14),0))","v":""},{"$f":"IF(ROW(B19)-1>=$E$14,\"\",OFFSET(INDIRECT(MID(CELL(\"filename\",Sheet1!$A$15),FIND(\"]\",CELL(\"filename\",Sheet1!$A$15))+1,31)&\"!\"&ADDRESS(MATCH(Sheet6!$D$9,Sheet1!C:C,0)+1,3,4)),ROW(B19)-1+SUM($B$14:$D$14),0))","v":1082},1]
[null,{"$f":"IF(ROW(B20)-1>=$B$14,\"\",OFFSET(INDIRECT(MID(CELL(\"filename\",Sheet1!$A$15),FIND(\"]\",CELL(\"filename\",Sheet1!$A$15))+1,31)&\"!\"&ADDRESS(MATCH(Sheet6!$D$9,Sheet1!C:C,0)+1,3,4)),ROW(B20)-1,0))","v":2065},{"$f":"IF(ROW(B20)-1>=$C$14,\"\",OFFSET(INDIRECT(MID(CELL(\"filename\",Sheet1!$A$15),FIND(\"]\",CELL(\"filename\",Sheet1!$A$15))+1,31)&\"!\"&ADDRESS(MATCH(Sheet6!$D$9,Sheet1!C:C,0)+1,3,4)),ROW(B20)-1+SUM($B$14:$B$14),0))","v":2072},{"$f":"IF(ROW(B20)-1>=$D$14,\"\",OFFSET(INDIRECT(MID(CELL(\"filename\",Sheet1!$A$15),FIND(\"]\",CELL(\"filename\",Sheet1!$A$15))+1,31)&\"!\"&ADDRESS(MATCH(Sheet6!$D$9,Sheet1!C:C,0)+1,3,4)),ROW(B20)-1+SUM($B$14:$C$14),0))","v":""},{"$f":"IF(ROW(B20)-1>=$E$14,\"\",OFFSET(INDIRECT(MID(CELL(\"filename\",Sheet1!$A$15),FIND(\"]\",CELL(\"filename\",Sheet1!$A$15))+1,31)&\"!\"&ADDRESS(MATCH(Sheet6!$D$9,Sheet1!C:C,0)+1,3,4)),ROW(B20)-1+SUM($B$14:$D$14),0))","v":2082},1]
[]
[null,"परीक्षा प्रभारी",null,null,"केन्द्राधीक्षक "]
[null,{"$f":"Sheet2!$B$37","v":"XYZ (Lecturer)"},null,null,{"$f":"Sheet2!$E$37","v":"XYZ (Principal)"}]

{"sheet":"Sheet8","index":7,"n_rows":37,"n_cols":6,"rows_kept":37,"merged":[[0,1,0,4],[1,1,1,4],[2,1,2,4],[3,1,3,4],[4,1,4,4],[5,1,5,4],[7,1,7,4],[8,1,8,2],[8,3,8,4],[9,1,9,4],[10,1,10,4],[11,1,11,4]]}
[null,{"$f":"Sheet2!$B$1","v":"Half Yearly Examination 2024"}]
[null,"परीक्षा केंद्र नाम एवं परीक्षा केंद्र क्रमांक"]
[null,{"$f":"Sheet2!$B$3","v":"Govt Sr Sc School Malutana (216405)"}]
[null,"परीक्षा कक्ष / हॉल क्रमांक"]
[null,{"$f":"Sheet2!$K$7","v":{"v":7,"d":"07"}}]
[null,"परीक्षा दिनांक (दिवस) ... से ... तक"]
[null,{"$f":"Sheet2!$B$7","v":"14-12-2024"},{"$f":"IF(B7=\"\",\"\",TEXT(B7,\"DDDD\"))","v":"Saturday"},{"$f":"Sheet2!$D$7","v":"24-12-2024"},{"$f":"IF(D7=\"\",\"\",TEXT(D7,\"DDDD\"))","v":"Tuesday"}]
[null,"परीक्षार्थी रोल नंबर ... से ... तक"]
[null,{"$f":"IF(B14>0,B15,IF(C14>0,C15,IF(D14>0,D15,IF(E14>0,E15,0))))","v":183},null,{"$f":"IF(E14>0,LOOKUP(2,1/(E15:E34<>\"\"),E15:E34),IF(D14>0,LOOKUP(2,1/(D15:D34<>\"\"),D15:D34),IF(C14>0,LOOKUP(2,1/(C15:C34<>\"\"),C15:C34),IF(B14>0,LOOKUP(2,1/(B15:B34<>\"\"),B15:B34),0))))","v":196}]
[null,"कुल सम्मिलित परीक्षार्थी "]
[null,{"$f":"COUNTIF($B$15:$E$34,\">0\")","v":40}]
[null,"परीक्षार्थी बैठक व्यवस्था"]
[null,"पंक्ति 1","पंक्ति 2","पंक्ति 3","पंक्ति 4"]
[null,{"$f":"Sheet2!L7","v":10},{"$f":"Sheet2!M7","v":10},{"$f":"Sheet2!N7","v":10},{"$f":"Sheet2!O7","v":10}]
[null,{"$f":"IF(ROW(B1)-1>=$B$14,\"\",OFFSET(INDIRECT(MID(CELL(\"filename\",Sheet1!$A$15),FIND(\"]\",CELL(\"filename\",Sheet1!$A$15))+1,31)&\"!\"&ADDRESS(MATCH(Sheet7!$D$9,Sheet1!C:C,0)+1,3,4)),ROW(B1)-1,0))","v":183},{"$f":"IF(ROW(B1)-1>=$C$14,\"\",OFFSET(INDIRECT(MID(CELL(\"filename\",Sheet1!$A$15),FIND(\"]\",CELL(\"filename\",Sheet1!$A$15))+1,31)&\"!\"&ADDRESS(MATCH(Sheet7!$D$9,Sheet1!C:C,0)+1,3,4)),ROW(B1)-1+SUM($B$14:$B$14),0))","v":1086},{"$f":"IF(ROW(B1)-1>=$D$14,\"\",OFFSET(INDIRECT(MID(CELL(\"filename\",Sheet1!$A$15),FIND(\"]\",CELL(\"filename\",Sheet1!$A$15))+1,31)&\"!\"&ADDRESS(MATCH(Sheet7!$D$9,Sheet1!C:C,0)+1,3,4)),ROW(B1)-1+SUM($B$14:$C$14),0))","v":2089},{"$f":"IF(ROW(B1)-1>=$E$14,\"\",OFFSET(INDIRECT(MID(CELL(\"filename\",Sheet1!$A$15),FIND(\"]\",CELL(\"filename\",Sheet1!$A$15))+1,31)&\"!\"&ADDRESS(MATCH(Sheet7!$D$9,Sheet1!C:C,0)+1,3,4)),ROW(B1)-1+SUM($B$14:$D$14),0))","v":193},{"$f":"IF(SUM(B15:E15)>0,1,\"\")","v":1}]
[null,{"$f":"IF(ROW(B2)-1>=$B$14,\"\",OFFSET(INDIRECT(MID(CELL(\"filename\",Sheet1!$A$15),FIND(\"]\",CELL(\"filename\",Sheet1!$A$15))+1,31)&\"!\"&ADDRESS(MATCH(Sheet7!$D$9,Sheet1!C:C,0)+1,3,4)),ROW(B2)-1,0))","v":1083},{"$f":"IF(ROW(B2)-1>=$C$14,\"\",OFFSET(INDIRECT(MID(CELL(\"filename\",Sheet1!$A$15),FIND(\"]\",CELL(\"filename\",Sheet1!$A$15))+1,31)&\"!\"&ADDRESS(MATCH(Sheet7!$D$9,Sheet1!C:C,0)+1,3,4)),ROW(B2)-1+SUM($B$14:$B$14),0))","v":2086},{"$f":"IF(ROW(B2)-1>=$D$14,\"\",OFFSET(INDIRECT(MID(CELL(\"filename\",Sheet1!$A$15),FIND(\"]\",CELL(\"filename\",Sheet1!$A$15))+1,31)&\"!\"&ADDRESS(MATCH(Sheet7!$D$9,Sheet1!C:C,0)+1,3,4)),ROW(B2)-1+SUM($B$14:$C$14),0))","v":190},{"$f":"IF(ROW(B2)-1>=$E$14,\"\",OFFSET(INDIRECT(MID(CELL(\"filename\",Sheet1!$A$15),FIND(\"]\",CELL(\"filename\",Sheet1!$A$15))+1,31)&\"!\"&ADDRESS(MATCH(Sheet7!$D$9,Sheet1!C:C,0)+1,3,4)),ROW(B2)-1+SUM($B$14:$D$14),0))","v":1093},{"$f":"IF(SUM(B16:E16)>0,1,\"\")","v":1}]
[null,{"$f":"IF(ROW(B3)-1>=$B$14,\"\",OFFSET(INDIRECT(MID(CELL(\"filename\",Sheet1!$A$15),FIND(\"]\",CELL(\"filename\",Sheet1!$A$15))+1,31)&\"!\"&ADDRESS(MATCH(Sheet7!$D$9,Sheet1!C:C,0)+1,3,4)),ROW(B3)-1,0))","v":2083},{"$f":"IF(ROW(B3)-1>=$C$14,\"\",OFFSET(INDIRECT(MID(CELL(\"filename\",Sheet1!$A$15),FIND(\"]\",CELL(\"filename\",Sheet1!$A$15))+1,31)&\"!\"&ADDRESS(MATCH(Sheet7!$D$9,Sheet1!C:C,0)+1,3,4)),ROW(B3)-1+SUM($B$14:$B$14),0))","v":187},{"$f":"IF(ROW(B3)-1>=$D$14,\"\",OFFSET(INDIRECT(MID(CELL(\"filename\",Sheet1!$A$15),FIND(\"]\",CELL(\"filename\",Sheet1!$A$15))+1,31)&\"!\"&ADDRESS(MATCH(Sheet7!$D$9,Sheet1!C:C,0)+1,3,4)),ROW(B3)-1+SUM($B$14:$C$14),0))","v":1090},{"$f":"IF(ROW(B3)-1>=$E$14,\"\",OFFSET(INDIRECT(MID(CELL(\"filename\",Sheet1!$A$15),FIND(\"]\",CELL(\"filename\",Sheet1!$A$15))+1,31)&\"!\"&ADDRESS(MATCH(Sheet7!$D$9,Sheet1!C:C,0)+1,3,4)),ROW(B3)-1+SUM($B$14:$D$14),0))","v":2093},1]
[null,{"$f":"IF(ROW(B4)-1>=$B$14,\"\",OFFSET(INDIRECT(MID(CELL(\"filename\",Sheet1!$A$15),FIND(\"]\",CELL(\"filename\",Sheet1!$A$15))+1,31)&\"!\"&ADDRESS(MATCH(Sheet7!$D$9,Sheet1!C:C,0)+1,3,4)),ROW(B4)-1,0))","v":184},{"$f":"IF(ROW(B4)-1>=$C$14,\"\",OFFSET(INDIRECT(MID(CELL(\"filename\",Sheet1!$A$15),FIND(\"]\",CELL(\"filename\",Sheet1!$A$15))+1,31)&\"!\"&ADDRESS(MATCH(Sheet7!$D$9,Sheet1!C:C,0)+1,3,4)),ROW(B4)-1+SUM($B$14:$B$14),0))","v":1087},{"$f":"IF(ROW(B4)-1>=$D$14,\"\",OFFSET(INDIRECT(MID(CELL(\"filename\",Sheet1!$A$15),FIND(\"]\",CELL(\"filename\",Sheet1!$A$15))+1,31)&\"!\"&ADDRESS(MATCH(Sheet7!$D$9,Sheet1!C:C,0)+1,3,4)),ROW(B4)-1+SUM($B$14:$C$14),0))","v":2090},{"$f":"IF(ROW(B4)-1>=$E$14,\"\",OFFSET(INDIRECT(MID(CELL(\"filename\",Sheet1!$A$15),FIND(\"]\",CELL(\"filename\",Sheet1!$A$15))+1,31)&\"!\"&ADDRESS(MATCH(Sheet7!$D$9,Sheet1!C:C,0)+1,3,4)),ROW(B4)-1+SUM($B$14:$D$14),0))","v":194},1]
[null,{"$f":"IF(ROW(B5)-1>=$B$14,\"\",OFFSET(INDIRECT(MID(CELL(\"filename\",Sheet1!$A$15),FIND(\"]\",CELL(\"filename\",Sheet1!$A$15))+1,31)&\"!\"&ADDRESS(MATCH(Sheet7!$D$9,Sheet1!C:C,0)+1,3,4)),ROW(B5)-1,0))","v":1084},{"$f":"IF(ROW(B5)-1>=$C$14,\"\",OFFSET(INDIRECT(MID(CELL(\"filename\",Sheet1!$A$15),FIND(\"]\",CELL(\"filename\",Sheet1!$A$15))+1,31)&\"!\"&ADDRESS(MATCH(Sheet7!$D$9,Sheet1!C:C,0)+1,3,4)),ROW(B5)-1+SUM($B$14:$B$14),0))","v":2087},{"$f":"IF(ROW(B5)-1>=$D$14,\"\",OFFSET(INDIRECT(MID(CELL(\"filename\",Sheet1!$A$15),FIND(\"]\",CELL(\"filename\",Sheet1!$A$15))+1,31)&\"!\"&ADDRESS(MATCH(Sheet7!$D$9,Sheet1!C:C,0)+1,3,4)),ROW(B5)-1+SUM($B$14:$C$14),0))","v":191},{"$f":"IF(ROW(B5)-1>=$E$14,\"\",OFFSET(INDIRECT(MID(CELL(\"filename\",Sheet1!$A$15),FIND(\"]\",CELL(\"filename\",Sheet1!$A$15))+1,31)&\"!\"&ADDRESS(MATCH(Sheet7!$D$9,Sheet1!C:C,0)+1,3,4)),ROW(B5)-1+SUM($B$14:$D$14),0))","v":1094},1]
[null,{"$f":"IF(ROW(B6)-1>=$B$14,\"\",OFFSET(INDIRECT(MID(CELL(\"filename\",Sheet1!$A$15),FIND(\"]\",CELL(\"filename\",Sheet1!$A$15))+1,31)&\"!\"&ADDRESS(MATCH(Sheet7!$D$9,Sheet1!C:C,0)+1,3,4)),ROW(B6)-1,0))","v":2084},{"$f":"IF(ROW(B6)-1>=$C$14,\"\",OFFSET(INDIRECT(MID(CELL(\"filename\",Sheet1!$A$15),FIND(\"]\",CELL(\"filename\",Sheet1!$A$15))+1,31)&\"!\"&ADDRESS(MATCH(Sheet7!$D$9,Sheet1!C:C,0)+1,3,4)),ROW(B6)-1+SUM($B$14:$B$14),0))","v":188},{"$f":"IF(ROW(B6)-1>=$D$14,\"\",OFFSET(INDIRECT(MID(CELL(\"filename\",Sheet1!$A$15),FIND(\"]\",CELL(\"filename\",Sheet1!$A$15))+1,31)&\"!\"&ADDRESS(MATCH(Sheet7!$D$9,Sheet1!C:C,0)+1,3,4)),ROW(B6)-1+SUM($B$14:$C$14),0))","v":1091},{"$f":"IF(ROW(B6)-1>=$E$14,\"\",OFFSET(INDIRECT(MID(CELL(\"filename\",Sheet1!$A$15),FIND(\"]\",CELL(\"filename\",Sheet1!$A$15))+1,31)&\"!\"&ADDRESS(MATCH(Sheet7!$D$9,Sheet1!C:C,0)+1,3,4)),ROW(B6)-1+SUM($B$14:$D$14),0))","v":2094},1]
[null,{"$f":"IF(ROW(B7)-1>=$B$14,\"\",OFFSET(INDIRECT(MID(CELL(\"filename\",Sheet1!$A$15),FIND(\"]\",CELL(\"filename\",Sheet1!$A$15))+1,31)&\"!\"&ADDRESS(MATCH(Sheet7!$D$9,Sheet1!C:C,0)+1,3,4)),ROW(B7)-1,0))","v":185},{"$f":"IF(ROW(B7)-1>=$C$14,\"\",OFFSET(INDIRECT(MID(CELL(\"filename\",Sheet1!$A$15),FIND(\"]\",CELL(\"filename\",Sheet1!$A$15))+1,31)&\"!\"&ADDRESS(MATCH(Sheet7!$D$9,Sheet1!C:C,0)+1,3,4)),ROW(B7)-1+SUM($B$14:$B$14),0))","v":1088},{"$f":"IF(ROW(B7)-1>=$D$14,\"\",OFFSET(INDIRECT(MID(CELL(\"filename\",Sheet1!$A$15),FIND(\"]\",CELL(\"filename\",Sheet1!$A$15))+1,31)&\"!\"&ADDRESS(MATCH(Sheet7!$D$9,Sheet1!C:C,0)+1,3,4)),ROW(B7)-1+SUM($B$14:$C$14),0))","v":2091},{"$f":"IF(ROW(B7)-1>=$E$14,\"\",OFFSET(INDIRECT(MID(CELL(\"filename\",Sheet1!$A$15),FIND(\"]\",CELL(\"filename\",Sheet1!$A$15))+1,31)&\"!\"&ADDRESS(MATCH(Sheet7!$D$9,Sheet1!C:C,0)+1,3,4)),ROW(B7)-1+SUM($B$14:$D$14),0))","v":195},1]
[null,{"$f":"IF(ROW(B8)-1>=$B$14,\"\",OFFSET(INDIRECT(MID(CELL(\"filename\",Sheet1!$A$15),FIND(\"]\",CELL(\"filename\",Sheet1!$A$15))+1,31)&\"!\"&ADDRESS(MATCH(Sheet7!$D$9,Sheet1!C:C,0)+1,3,4)),ROW(B8)-1,0))","v":1085},{"$f":"IF(ROW(B8)-1>=$C$14,\"\",OFFSET(INDIRECT(MID(CELL(\"filename\",Sheet1!$A$15),FIND(\"]\",CELL(\"filename\",Sheet1!$A$15))+1,31)&\"!\"&ADDRESS(MATCH(Sheet7!$D$9,Sheet1!C:C,0)+1,3,4)),ROW(B8)-1+SUM($B$14:$B$14),0))","v":2088},{"$f":"IF(ROW(B8)-1>=$D$14,\"\",OFFSET(INDIRECT(MID(CELL(\"filename\",Sheet1!$A$15),FIND(\"]\",CELL(\"filename\",Sheet1!$A$15))+1,31)&\"!\"&ADDRESS(MATCH(Sheet7!$D$9,Sheet1!C:C,0)+1,3,4)),ROW(B8)-1+SUM($B$14:$C$14),0))","v":192},{"$f":"IF(ROW(B8)-1>=$E$14,\"\",OFFSET(INDIRECT(MID(CELL(\"filename\",Sheet1!$A$15),FIND(\"]\",CELL(\"filename\",Sheet1!$A$15))+1,31)&\"!\"&ADDRESS(MATCH(Sheet7!$D$9,Sheet1!C:C,0)+1,3,4)),ROW(B8)-1+SUM($B$14:$D$14),0))","v":1095},1]
[null,{"$f":"IF(ROW(B9)-1>=$B$14,\"\",OFFSET(INDIRECT(MID(CELL(\"filename\",Sheet1!$A$15),FIND(\"]\",CELL(\"filename\",Sheet1!$A$15))+1,31)&\"!\"&ADDRESS(MATCH(Sheet7!$D$9,Sheet1!C:C,0)+1,3,4)),ROW(B9)-1,0))","v":2085},{"$f":"IF(ROW(B9)-1>=$C$14,\"\",OFFSET(INDIRECT(MID(CELL(\"filename\",Sheet1!$A$15),FIND(\"]\",CELL(\"filename\",Sheet1!$A$15))+1,31)&\"!\"&ADDRESS(MATCH(Sheet7!$D$9,Sheet1!C:C,0)+1,3,4)),ROW(B9)-1+SUM($B$14:$B$14),0))","v":189},{"$f":"IF(ROW(B9)-1>=$D$14,\"\",OFFSET(INDIRECT(MID(CELL(\"filename\",Sheet1!$A$15),FIND(\"]\",CELL(\"filename\",Sheet1!$A$15))+1,31)&\"!\"&ADDRESS(MATCH(Sheet7!$D$9,Sheet1!C:C,0)+1,3,4)),ROW(B9)-1+SUM($B$14:$C$14),0))","v":1092},{"$f":"IF(ROW(B9)-1>=$E$14,\"\",OFFSET(INDIRECT(MID(CELL(\"filename\",Sheet1!$A$15),FIND(\"]\",CELL(\"filename\",Sheet1!$A$15))+1,31)&\"!\"&ADDRESS(MATCH(Sheet7!$D$9,Sheet1!C:C,0)+1,3,4)),ROW(B9)-1+SUM($B$14:$D$14),0))","v":2095},1]
[null,{"$f":"IF(ROW(B10)-1>=$B$14,\"\",OFFSET(INDIRECT(MID(CELL(\"filename\",Sheet1!$A$15),FIND(\"]\",CELL(\"filename\",Sheet1!$A$15))+1,31)&\"!\"&ADDRESS(MATCH(Sheet7!$D$9,Sheet1!C:C,0)+1,3,4)),ROW(B10)-1,0))","v":186},{"$f":"IF(ROW(B10)-1>=$C$14,\"\",OFFSET(INDIRECT(MID(CELL(\"filename\",Sheet1!$A$15),FIND(\"]\",CELL(\"filename\",Sheet1!$A$15))+1,31)&\"!\"&ADDRESS(MATCH(Sheet7!$D$9,Sheet1!C:C,0)+1,3,4)),ROW(B10)-1+SUM($B$14:$B$14),0))","v":1089},{"$f":"IF(ROW(B10)-1>=$D$14,\"\",OFFSET(INDIRECT(MID(CELL(\"filename\",Sheet1!$A$15),FIND(\"]\",CELL(\"filename\",Sheet1!$A$15))+1,31)&\"!\"&ADDRESS(MATCH(Sheet7!$D$9,Sheet1!C:C,0)+1,3,4)),ROW(B10)-1+SUM($B$14:$C$14),0))","v":2092},{"$f":"IF(ROW(B10)-1>=$E$14,\"\",OFFSET(INDIRECT(MID(CELL(\"filename\",Sheet1!$A$15),FIND(\"]\",CELL(\"filename\",Sheet1!$A$15))+1,31)&\"!\"&ADDRESS(MATCH(Sheet7!$D$9,Sheet1!C:C,0)+1,3,4)),ROW(B10)-1+SUM($B$14:$D$14),0))","v":196},1]
[null,{"$f":"IF(ROW(B11)-1>=$B$14,\"\",OFFSET(INDIRECT(MID(CELL(\"filename\",Sheet1!$A$15),FIND(\"]\",CELL(\"filename\",Sheet1!$A$15))+1,31)&\"!\"&ADDRESS(MATCH(Sheet7!$D$9,Sheet1!C:C,0)+1,3,4)),ROW(B11)-1,0))","v":""},{"$f":"IF(ROW(B11)-1>=$C$14,\"\",OFFSET(INDIRECT(MID(CELL(\"filename\",Sheet1!$A$15),FIND(\"]\",CELL(\"filename\",Sheet1!$A$15))+1,31)&\"!\"&ADDRESS(MATCH(Sheet7!$D$9,Sheet1!C:C,0)+1,3,4)),ROW(B11)-1+SUM($B$14:$B$14),0))","v":""},{"$f":"IF(ROW(B11)-1>=$D$14,\"\",OFFSET(INDIRECT(MID(CELL(\"filename\",Sheet1!$A$15),FIND(\"]\",CELL(\"filename\",Sheet1!$A$15))+1,31)&\"!\"&ADDRESS(MATCH(Sheet7!$D$9,Sheet1!C:C,0)+1,3,4)),ROW(B11)-1+SUM($B$14:$C$14),0))","v":""},{"$f":"IF(ROW(B11)-1>=$E$14,\"\",OFFSET(INDIRECT(MID(CELL(\"filename\",Sheet1!$A$15),FIND(\"]\",CELL(\"filename\",Sheet1!$A$15))+1,31)&\"!\"&ADDRESS(MATCH(Sheet7!$D$9,Sheet1!C:C,0)+1,3,4)),ROW(B11)-1+SUM($B$14:$D$14),0))","v":""},""]
[null,{"$f":"IF(ROW(B12)-1>=$B$14,\"\",OFFSET(INDIRECT(MID(CELL(\"filename\",Sheet1!$A$15),FIND(\"]\",CELL(\"filename\",Sheet1!$A$15))+1,31)&\"!\"&ADDRESS(MATCH(Sheet7!$D$9,Sheet1!C:C,0)+1,3,4)),ROW(B12)-1,0))","v":""},{"$f":"IF(ROW(B12)-1>=$C$14,\"\",OFFSET(INDIRECT(MID(CELL(\"filename\",Sheet1!$A$15),FIND(\"]\",CELL(\"filename\",Sheet1!$A$15))+1,31)&\"!\"&ADDRESS(MATCH(Sheet7!$D$9,Sheet1!C:C,0)+1,3,4)),ROW(B12)-1+SUM($B$14:$B$14),0))","v":""},{"$f":"IF(ROW(B12)-1>=$D$14,\"\",OFFSET(INDIRECT(MID(CELL(\"filename\",Sheet1!$A$15),FIND(\"]\",CELL(\"filename\",Sheet1!$A$15))+1,31)&\"!\"&ADDRESS(MATCH(Sheet7!$D$9,Sheet1!C:C,0)+1,3,4)),ROW(B12)-1+SUM($B$14:$C$14),0))","v":""},{"$f":"IF(ROW(B12)-1>=$E$14,\"\",OFFSET(INDIRECT(MID(CELL(\"filename\",Sheet1!$A$15),FIND(\"]\",CELL(\"filename\",Sheet1!$A$15))+1,31)&\"!\"&ADDRESS(MATCH(Sheet7!$D$9,Sheet1!C:C,0)+1,3,4)),ROW(B12)-1+SUM($B$14:$D$14),0))","v":""},""]
[null,{"$f":"IF(ROW(B13)-1>=$B$14,\"\",OFFSET(INDIRECT(MID(CELL(\"filename\",Sheet1!$A$15),FIND(\"]\",CELL(\"filename\",Sheet1!$A$15))+1,31)&\"!\"&ADDRESS(MATCH(Sheet7!$D$9,Sheet1!C:C,0)+1,3,4)),ROW(B13)-1,0))","v":""},{"$f":"IF(ROW(B13)-1>=$C$14,\"\",OFFSET(INDIRECT(MID(CELL(\"filename\",Sheet1!$A$15),FIND(\"]\",CELL(\"filename\",Sheet1!$A$15))+1,31)&\"!\"&ADDRESS(MATCH(Sheet7!$D$9,Sheet1!C:C,0)+1,3,4)),ROW(B13)-1+SUM($B$14:$B$14),0))","v":""},{"$f":"IF(ROW(B13)-1>=$D$14,\"\",OFFSET(INDIRECT(MID(CELL(\"filename\",Sheet1!$A$15),FIND(\"]\",CELL(\"filename\",Sheet1!$A$15))+1,31)&\"!\"&ADDRESS(MATCH(Sheet7!$D$9,Sheet1!C:C,0)+1,3,4)),ROW(B13)-1+SUM($B$14:$C$14),0))","v":""},{"$f":"IF(ROW(B13)-1>=$E$14,\"\",OFFSET(INDIRECT(MID(CELL(\"filename\",Sheet1!$A$15),FIND(\"]\",CELL(\"filename\",Sheet1!$A$15))+1,31)&\"!\"&ADDRESS(MATCH(Sheet7!$D$9,Sheet1!C:C,0)+1,3,4)),ROW(B13)-1+SUM($B$14:$D$14),0))","v":""},""]
[null,{"$f":"IF(ROW(B14)-1>=$B$14,\"\",OFFSET(INDIRECT(MID(CELL(\"filename\",Sheet1!$A$15),FIND(\"]\",CELL(\"filename\",Sheet1!$A$15))+1,31)&\"!\"&ADDRESS(MATCH(Sheet7!$D$9,Sheet1!C:C,0)+1,3,4)),ROW(B14)-1,0))","v":""},{"$f":"IF(ROW(B14)-1>=$C$14,\"\",OFFSET(INDIRECT(MID(CELL(\"filename\",Sheet1!$A$15),FIND(\"]\",CELL(\"filename\",Sheet1!$A$15))+1,31)&\"!\"&ADDRESS(MATCH(Sheet7!$D$9,Sheet1!C:C,0)+1,3,4)),ROW(B14)-1+SUM($B$14:$B$14),0))","v":""},{"$f":"IF(ROW(B14)-1>=$D$14,\"\",OFFSET(INDIRECT(MID(CELL(\"filename\",Sheet1!$A$15),FIND(\"]\",CELL(\"filename\",Sheet1!$A$15))+1,31)&\"!\"&ADDRESS(MATCH(Sheet7!$D$9,Sheet1!C:C,0)+1,3,4)),ROW(B14)-1+SUM($B$14:$C$14),0))","v":""},{"$f":"IF(ROW(B14)-1>=$E$14,\"\",OFFSET(INDIRECT(MID(CELL(\"filename\",Sheet1!$A$15),FIND(\"]\",CELL(\"filename\",Sheet1!$A$15))+1,31)&\"!\"&ADDRESS(MATCH(Sheet7!$D$9,Sheet1!C:C,0)+1,3,4)),ROW(B14)-1+SUM($B$14:$D$14),0))","v":""},""]
[null,{"$f":"IF(ROW(B15)-1>=$B$14,\"\",OFFSET(INDIRECT(MID(CELL(\"filename\",Sheet1!$A$15),FIND(\"]\",CELL(\"filename\",Sheet1!$A$15))+1,31)&\"!\"&ADDRESS(MATCH(Sheet7!$D$9,Sheet1!C:C,0)+1,3,4)),ROW(B15)-1,0))","v":""},{"$f":"IF(ROW(B15)-1>=$C$14,\"\",OFFSET(INDIRECT(MID(CELL(\"filename\",Sheet1!$A$15),FIND(\"]\",CELL(\"filename\",Sheet1!$A$15))+1,31)&\"!\"&ADDRESS(MATCH(Sheet7!$D$9,Sheet1!C:C,0)+1,3,4)),ROW(B15)-1+SUM($B$14:$B$14),0))","v":""},{"$f":"IF(ROW(B15)-1>=$D$14,\"\",OFFSET(INDIRECT(MID(CELL(\"filename\",Sheet1!$A$15),FIND(\"]\",CELL(\"filename\",Sheet1!$A$15))+1,31)&\"!\"&ADDRESS(MATCH(Sheet7!$D$9,Sheet1!C:C,0)+1,3,4)),ROW(B15)-1+SUM($B$14:$C$14),0))","v":""},{"$f":"IF(ROW(B15)-1>=$E$14,\"\",OFFSET(INDIRECT(MID(CELL(\"filename\",Sheet1!$A$15),FIND(\"]\",CELL(\"filename\",Sheet1!$A$15))+1,31)&\"!\"&ADDRESS(MATCH(Sheet7!$D$9,Sheet1!C:C,0)+1,3,4)),ROW(B15)-1+SUM($B$14:$D$14),0))","v":""},""]
[null,{"$f":"IF(ROW(B16)-1>=$B$14,\"\",OFFSET(INDIRECT(MID(CELL(\"filename\",Sheet1!$A$15),FIND(\"]\",CELL(\"filename\",Sheet1!$A$15))+1,31)&\"!\"&ADDRESS(MATCH(Sheet7!$D$9,Sheet1!C:C,0)+1,3,4)),ROW(B16)-1,0))","v":""},{"$f":"IF(ROW(B16)-1>=$C$14,\"\",OFFSET(INDIRECT(MID(CELL(\"filename\",Sheet1!$A$15),FIND(\"]\",CELL(\"filename\",Sheet1!$A$15))+1,31)&\"!\"&ADDRESS(MATCH(Sheet7!$D$9,Sheet1!C:C,0)+1,3,4)),ROW(B16)-1+SUM($B$14:$B$14),0))","v":""},{"$f":"IF(ROW(B16)-1>=$D$14,\"\",OFFSET(INDIRECT(MID(CELL(\"filename\",Sheet1!$A$15),FIND(\"]\",CELL(\"filename\",Sheet1!$A$15))+1,31)&\"!\"&ADDRESS(MATCH(Sheet7!$D$9,Sheet1!C:C,0)+1,3,4)),ROW(B16)-1+SUM($B$14:$C$14),0))","v":""},{"$f":"IF(ROW(B16)-1>=$E$14,\"\",OFFSET(INDIRECT(MID(CELL(\"filename\",Sheet1!$A$15),FIND(\"]\",CELL(\"filename\",Sheet1!$A$15))+1,31)&\"!\"&ADDRESS(MATCH(Sheet7!$D$9,Sheet1!C:C,0)+1,3,4)),ROW(B16)-1+SUM($B$14:$D$14),0))","v":""},""]
[null,{"$f":"IF(ROW(B17)-1>=$B$14,\"\",OFFSET(INDIRECT(MID(CELL(\"filename\",Sheet1!$A$15),FIND(\"]\",CELL(\"filename\",Sheet1!$A$15))+1,31)&\"!\"&ADDRESS(MATCH(Sheet7!$D$9,Sheet1!C:C,0)+1,3,4)),ROW(B17)-1,0))","v":""},{"$f":"IF(ROW(B17)-1>=$C$14,\"\",OFFSET(INDIRECT(MID(CELL(\"filename\",Sheet1!$A$15),FIND(\"]\",CELL(\"filename\",Sheet1!$A$15))+1,31)&\"!\"&ADDRESS(MATCH(Sheet7!$D$9,Sheet1!C:C,0)+1,3,4)),ROW(B17)-1+SUM($B$14:$B$14),0))","v":""},{"$f":"IF(ROW(B17)-1>=$D$14,\"\",OFFSET(INDIRECT(MID(CELL(\"filename\",Sheet1!$A$15),FIND(\"]\",CELL(\"filename\",Sheet1!$A$15))+1,31)&\"!\"&ADDRESS(MATCH(Sheet7!$D$9,Sheet1!C:C,0)+1,3,4)),ROW(B17)-1+SUM($B$14:$C$14),0))","v":""},{"$f":"IF(ROW(B17)-1>=$E$14,\"\",OFFSET(INDIRECT(MID(CELL(\"filename\",Sheet1!$A$15),FIND(\"]\",CELL(\"filename\",Sheet1!$A$15))+1,31)&\"!\"&ADDRESS(MATCH(Sheet7!$D$9,Sheet1!C:C,0)+1,3,4)),ROW(B17)-1+SUM($B$14:$D$14),0))","v":""},""]
[null,{"$f":"IF(ROW(B18)-1>=$B$14,\"\",OFFSET(INDIRECT(MID(CELL(\"filename\",Sheet1!$A$15),FIND(\"]\",CELL(\"filename\",Sheet1!$A$15))+1,31)&\"!\"&ADDRESS(MATCH(Sheet7!$D$9,Sheet1!C:C,0)+1,3,4)),ROW(B18)-1,0))","v":""},{"$f":"IF(ROW(B18)-1>=$C$14,\"\",OFFSET(INDIRECT(MID(CELL(\"filename\",Sheet1!$A$15),FIND(\"]\",CELL(\"filename\",Sheet1!$A$15))+1,31)&\"!\"&ADDRESS(MATCH(Sheet7!$D$9,Sheet1!C:C,0)+1,3,4)),ROW(B18)-1+SUM($B$14:$B$14),0))","v":""},{"$f":"IF(ROW(B18)-1>=$D$14,\"\",OFFSET(INDIRECT(MID(CELL(\"filename\",Sheet1!$A$15),FIND(\"]\",CELL(\"filename\",Sheet1!$A$15))+1,31)&\"!\"&ADDRESS(MATCH(Sheet7!$D$9,Sheet1!C:C,0)+1,3,4)),ROW(B18)-1+SUM($B$14:$C$14),0))","v":""},{"$f":"IF(ROW(B18)-1>=$E$14,\"\",OFFSET(INDIRECT(MID(CELL(\"filename\",Sheet1!$A$15),FIND(\"]\",CELL(\"filename\",Sheet1!$A$15))+1,31)&\"!\"&ADDRESS(MATCH(Sheet7!$D$9,Sheet1!C:C,0)+1,3,4)),ROW(B18)-1+SUM($B$14:$D$14),0))","v":""},""]
[null,{"$f":"IF(ROW(B19)-1>=$B$14,\"\",OFFSET(INDIRECT(MID(CELL(\"filename\",Sheet1!$A$15),FIND(\"]\",CELL(\"filename\",Sheet1!$A$15))+1,31)&\"!\"&ADDRESS(MATCH(Sheet7!$D$9,Sheet1!C:C,0)+1,3,4)),ROW(B19)-1,0))","v":""},{"$f":"IF(ROW(B19)-1>=$C$14,\"\",OFFSET(INDIRECT(MID(CELL(\"filename\",Sheet1!$A$15),FIND(\"]\",CELL(\"filename\",Sheet1!$A$15))+1,31)&\"!\"&ADDRESS(MATCH(Sheet7!$D$9,Sheet1!C:C,0)+1,3,4)),ROW(B19)-1+SUM($B$14:$B$14),0))","v":""},{"$f":"IF(ROW(B19)-1>=$D$14,\"\",OFFSET(INDIRECT(MID(CELL(\"filename\",Sheet1!$A$15),FIND(\"]\",CELL(\"filename\",Sheet1!$A$15))+1,31)&\"!\"&ADDRESS(MATCH(Sheet7!$D$9,Sheet1!C:C,0)+1,3,4)),ROW(B19)-1+SUM($B$14:$C$14),0))","v":""},{"$f":"IF(ROW(B19)-1>=$E$14,\"\",OFFSET(INDIRECT(MID(CELL(\"filename\",Sheet1!$A$15),FIND(\"]\",CELL(\"filename\",Sheet1!$A$15))+1,31)&\"!\"&ADDRESS(MATCH(Sheet7!$D$9,Sheet1!C:C,0)+1,3,4)),ROW(B19)-1+SUM($B$14:$D$14),0))","v":""},""]
[null,{"$f":"IF(ROW(B20)-1>=$B$14,\"\",OFFSET(INDIRECT(MID(CELL(\"filename\",Sheet1!$A$15),FIND(\"]\",CELL(\"filename\",Sheet1!$A$15))+1,31)&\"!\"&ADDRESS(MATCH(Sheet7!$D$9,Sheet1!C:C,0)+1,3,4)),ROW(B20)-1,0))","v":""},{"$f":"IF(ROW(B20)-1>=$C$14,\"\",OFFSET(INDIRECT(MID(CELL(\"filename\",Sheet1!$A$15),FIND(\"]\",CELL(\"filename\",Sheet1!$A$15))+1,31)&\"!\"&ADDRESS(MATCH(Sheet7!$D$9,Sheet1!C:C,0)+1,3,4)),ROW(B20)-1+SUM($B$14:$B$14),0))","v":""},{"$f":"IF(ROW(B20)-1>=$D$14,\"\",OFFSET(INDIRECT(MID(CELL(\"filename\",Sheet1!$A$15),FIND(\"]\",CELL(\"filename\",Sheet1!$A$15))+1,31)&\"!\"&ADDRESS(MATCH(Sheet7!$D$9,Sheet1!C:C,0)+1,3,4)),ROW(B20)-1+SUM($B$14:$C$14),0))","v":""},{"$f":"IF(ROW(B20)-1>=$E$14,\"\",OFFSET(INDIRECT(MID(CELL(\"filename\",Sheet1!$A$15),FIND(\"]\",CELL(\"filename\",Sheet1!$A$15))+1,31)&\"!\"&ADDRESS(MATCH(Sheet7!$D$9,Sheet1!C:C,0)+1,3,4)),ROW(B20)-1+SUM($B$14:$D$14),0))","v":""},""]
[]
[null,"परीक्षा प्रभारी",null,null,"केन्द्राधीक्षक "]
[null,{"$f":"Sheet2!$B$37","v":"XYZ (Lecturer)"},null,null,{"$f":"Sheet2!$E$37","v":"XYZ (Principal)"}]

{"sheet":"Sheet9","index":8,"n_rows":37,"n_cols":6,"rows_kept":37,"merged":[[0,1,0,4],[1,1,1,4],[2,1,2,4],[3,1,3,4],[4,1,4,4],[5,1,5,4],[7,1,7,4],[8,1,8,2],[8,3,8,4],[9,1,9,4],[10,1,10,4],[11,1,11,4]]}
[null,{"$f":"Sheet2!$B$1","v":"Half Yearly Examination 2024"}]
[null,"परीक्षा केंद्र नाम एवं परीक्षा केंद्र क्रमांक"]
[null,{"$f":"Sheet2!$B$3","v":"Govt Sr Sc School Malutana (216405)"}]
[null,"परीक्षा कक्ष / हॉल क्रमांक"]
[null,{"$f":"Sheet2!$K$8","v":{"v":8,"d":"08"}}]
[null,"परीक्षा दिनांक (दिवस) ... से ... तक"]
[null,{"$f":"Sheet2!$B$7","v":"14-12-2024"},{"$f":"IF(B7=\"\",\"\",TEXT(B7,\"DDDD\"))","v":"Saturday"},{"$f":"Sheet2!$D$7","v":"24-12-2024"},{"$f":"IF(D7=\"\",\"\",TEXT(D7,\"DDDD\"))","v":"Tuesday"}]
[null,"परीक्षार्थी रोल नंबर ... से ... तक"]
[null,{"$f":"IF(B14>0,B15,IF(C14>0,C15,IF(D14>0,D15,IF(E14>0,E15,0))))","v":1096},null,{"$f":"IF(E14>0,LOOKUP(2,1/(E15:E34<>\"\"),E15:E34),IF(D14>0,LOOKUP(2,1/(D15:D34<>\"\"),D15:D34),IF(C14>0,LOOKUP(2,1/(C15:C34<>\"\"),C15:C34),IF(B14>0,LOOKUP(2,1/(B15:B34<>\"\"),B15:B34),0))))","v":2101}]
[null,"कुल सम्मिलित परीक्षार्थी "]
[null,{"$f":"COUNTIF($B$15:$E$34,\">0\")","v":17}]
[null,"परीक्षार्थी बैठक व्यवस्था"]
[null,"पंक्ति 1","पंक्ति 2","पंक्ति 3","पंक्ति 4"]
[null,{"$f":"Sheet2!L8","v":6},{"$f":"Sheet2!M8","v":0},{"$f":"Sheet2!N8","v":0},{"$f":"Sheet2!O8","v":11}]
[null,{"$f":"IF(ROW(B1)-1>=$B$14,\"\",OFFSET(INDIRECT(MID(CELL(\"filename\",Sheet1!$A$15),FIND(\"]\",CELL(\"filename\",Sheet1!$A$15))+1,31)&\"!\"&ADDRESS(MATCH(Sheet8!$D$9,Sheet1!C:C,0)+1,3,4)),ROW(B1)-1,0))","v":1096},{"$f":"IF(ROW(B1)-1>=$C$14,\"\",OFFSET(INDIRECT(MID(CELL(\"filename\",Sheet1!$A$15),FIND(\"]\",CELL(\"filename\",Sheet1!$A$15))+1,31)&\"!\"&ADDRESS(MATCH(Sheet8!$D$9,Sheet1!C:C,0)+1,3,4)),ROW(B1)-1+SUM($B$14:$B$14),0))","v":""},{"$f":"IF(ROW(B1)-1>=$D$14,\"\",OFFSET(INDIRECT(MID(CELL(\"filename\",Sheet1!$A$15),FIND(\"]\",CELL(\"filename\",Sheet1!$A$15))+1,31)&\"!\"&ADDRESS(MATCH(Sheet8!$D$9,Sheet1!C:C,0)+1,3,4)),ROW(B1)-1+SUM($B$14:$C$14),0))","v":""},{"$f":"IF(ROW(B1)-1>=$E$14,\"\",OFFSET(INDIRECT(MID(CELL(\"filename\",Sheet1!$A$15),FIND(\"]\",CELL(\"filename\",Sheet1!$A$15))+1,31)&\"!\"&ADDRESS(MATCH(Sheet8!$D$9,Sheet1!C:C,0)+1,3,4)),ROW(B1)-1+SUM($B$14:$D$14),0))","v":1098},{"$f":"IF(SUM(B15:E15)>0,1,\"\")","v":1}]
[null,{"$f":"IF(ROW(B2)-1>=$B$14,\"\",OFFSET(INDIRECT(MID(CELL(\"filename\",Sheet1!$A$15),FIND(\"]\",CELL(\"filename\",Sheet1!$A$15))+1,31)&\"!\"&ADDRESS(MATCH(Sheet8!$D$9,Sheet1!C:C,0)+1,3,4)),ROW(B2)-1,0))","v":2096},{"$f":"IF(ROW(B2)-1>=$C$14,\"\",OFFSET(INDIRECT(MID(CELL(\"filename\",Sheet1!$A$15),FIND(\"]\",CELL(\"filename\",Sheet1!$A$15))+1,31)&\"!\"&ADDRESS(MATCH(Sheet8!$D$9,Sheet1!C:C,0)+1,3,4)),ROW(B2)-1+SUM($B$14:$B$14),0))","v":""},{"$f":"IF(ROW(B2)-1>=$D$14,\"\",OFFSET(INDIRECT(MID(CELL(\"filename\",Sheet1!$A$15),FIND(\"]\",CELL(\"filename\",Sheet1!$A$15))+1,31)&\"!\"&ADDRESS(MATCH(Sheet8!$D$9,Sheet1!C:C,0)+1,3,4)),ROW(B2)-1+SUM($B$14:$C$14),0))","v":""},{"$f":"IF(ROW(B2)-1>=$E$14,\"\",OFFSET(INDIRECT(MID(CELL(\"filename\",Sheet1!$A$15),FIND(\"]\",CELL(\"filename\",Sheet1!$A$15))+1,31)&\"!\"&ADDRESS(MATCH(Sheet8!$D$9,Sheet1!C:C,0)+1,3,4)),ROW(B2)-1+SUM($B$14:$D$14),0))","v":2098},{"$f":"IF(SUM(B16:E16)>0,1,\"\")","v":1}]
[null,{"$f":"IF(ROW(B3)-1>=$B$14,\"\",OFFSET(INDIRECT(MID(CELL(\"filename\",Sheet1!$A$15),FIND(\"]\",CELL(\"filename\",Sheet1!$A$15))+1,31)&\"!\"&ADDRESS(MATCH(Sheet8!$D$9,Sheet1!C:C,0)+1,3,4)),ROW(B3)-1,0))","v":197},{"$f":"IF(ROW(B3)-1>=$C$14,\"\",OFFSET(INDIRECT(MID(CELL(\"filename\",Sheet1!$A$15),FIND(\"]\",CELL(\"filename\",Sheet1!$A$15))+1,31)&\"!\"&ADDRESS(MATCH(Sheet8!$D$9,Sheet1!C:C,0)+1,3,4)),ROW(B3)-1+SUM($B$14:$B$14),0))","v":""},{"$f":"IF(ROW(B3)-1>=$D$14,\"\",OFFSET(INDIRECT(MID(CELL(\"filename\",Sheet1!$A$15),FIND(\"]\",CELL(\"filename\",Sheet1!$A$15))+1,31)&\"!\"&ADDRESS(MATCH(Sheet8!$D$9,Sheet1!C:C,0)+1,3,4)),ROW(B3)-1+SUM($B$14:$C$14),0))","v":""},{"$f":"IF(ROW(B3)-1>=$E$14,\"\",OFFSET(INDIRECT(MID(CELL(\"filename\",Sheet1!$A$15),FIND(\"]\",CELL(\"filename\",Sheet1!$A$15))+1,31)&\"!\"&ADDRESS(MATCH(Sheet8!$D$9,Sheet1!C:C,0)+1,3,4)),ROW(B3)-1+SUM($B$14:$D$14),0))","v":199},1]
[null,{"$f":"IF(ROW(B4)-1>=$B$14,\"\",OFFSET(INDIRECT(MID(CELL(\"filename\",Sheet1!$A$15),FIND(\"]\",CELL(\"filename\",Sheet1!$A$15))+1,31)&\"!\"&ADDRESS(MATCH(Sheet8!$D$9,Sheet1!C:C,0)+1,3,4)),ROW(B4)-1,0))","v":1097},{"$f":"IF(ROW(B4)-1>=$C$14,\"\",OFFSET(INDIRECT(MID(CELL(\"filename\",Sheet1!$A$15),FIND(\"]\",CELL(\"filename\",Sheet1!$A$15))+1,31)&\"!\"&ADDRESS(MATCH(Sheet8!$D$9,Sheet1!C:C,0)+1,3,4)),ROW(B4)-1+SUM($B$14:$B$14),0))","v":""},{"$f":"IF(ROW(B4)-1>=$D$14,\"\",OFFSET(INDIRECT(MID(CELL(\"filename\",Sheet1!$A$15),FIND(\"]\",CELL(\"filename\",Sheet1!$A$15))+1,31)&\"!\"&ADDRESS(MATCH(Sheet8!$D$9,Sheet1!C:C,0)+1,3,4)),ROW(B4)-1+SUM($B$14:$C$14),0))","v":""},{"$f":"IF(ROW(B4)-1>=$E$14,\"\",OFFSET(INDIRECT(MID(CELL(\"filename\",Sheet1!$A$15),FIND(\"]\",CELL(\"filename\",Sheet1!$A$15))+1,31)&\"!\"&ADDRESS(MATCH(Sheet8!$D$9,Sheet1!C:C,0)+1,3,4)),ROW(B4)-1+SUM($B$14:$D$14),0))","v":1099},1]
[null,{"$f":"IF(ROW(B5)-1>=$B$14,\"\",OFFSET(INDIRECT(MID(CELL(\"filename\",Sheet1!$A$15),FIND(\"]\",CELL(\"filename\",Sheet1!$A$15))+1,31)&\"!\"&ADDRESS(MATCH(Sheet8!$D$9,Sheet1!C:C,0)+1,3,4)),ROW(B5)-1,0))","v":2097},{"$f":"IF(ROW(B5)-1>=$C$14,\"\",OFFSET(INDIRECT(MID(CELL(\"filename\",Sheet1!$A$15),FIND(\"]\",CELL(\"filename\",Sheet1!$A$15))+1,31)&\"!\"&ADDRESS(MATCH(Sheet8!$D$9,Sheet1!C:C,0)+1,3,4)),ROW(B5)-1+SUM($B$14:$B$14),0))","v":""},{"$f":"IF(ROW(B5)-1>=$D$14,\"\",OFFSET(INDIRECT(MID(CELL(\"filename\",Sheet1!$A$15),FIND(\"]\",CELL(\"filename\",Sheet1!$A$15))+1,31)&\"!\"&ADDRESS(MATCH(Sheet8!$D$9,Sheet1!C:C,0)+1,3,4)),ROW(B5)-1+SUM($B$14:$C$14),0))","v":""},{"$f":"IF(ROW(B5)-1>=$E$14,\"\",OFFSET(INDIRECT(MID(CELL(\"filename\",Sheet1!$A$15),FIND(\"]\",CELL(\"filename\",Sheet1!$A$15))+1,31)&\"!\"&ADDRESS(MATCH(Sheet8!$D$9,Sheet1!C:C,0)+1,3,4)),ROW(B5)-1+SUM($B$14:$D$14),0))","v":2099},1]
[null,{"$f":"IF(ROW(B6)-1>=$B$14,\"\",OFFSET(INDIRECT(MID(CELL(\"filename\",Sheet1!$A$15),FIND(\"]\",CELL(\"filename\",Sheet1!$A$15))+1,31)&\"!\"&ADDRESS(MATCH(Sheet8!$D$9,Sheet1!C:C,0)+1,3,4)),ROW(B6)-1,0))","v":198},{"$f":"IF(ROW(B6)-1>=$C$14,\"\",OFFSET(INDIRECT(MID(CELL(\"filename\",Sheet1!$A$15),FIND(\"]\",CELL(\"filename\",Sheet1!$A$15))+1,31)&\"!\"&ADDRESS(MATCH(Sheet8!$D$9,Sheet1!C:C,0)+1,3,4)),ROW(B6)-1+SUM($B$14:$B$14),0))","v":""},{"$f":"IF(ROW(B6)-1>=$D$14,\"\",OFFSET(INDIRECT(MID(CELL(\"filename\",Sheet1!$A$15),FIND(\"]\",CELL(\"filename\",Sheet1!$A$15))+1,31)&\"!\"&ADDRESS(MATCH(Sheet8!$D$9,Sheet1!C:C,0)+1,3,4)),ROW(B6)-1+SUM($B$14:$C$14),0))","v":""},{"$f":"IF(ROW(B6)-1>=$E$14,\"\",OFFSET(INDIRECT(MID(CELL(\"filename\",Sheet1!$A$15),FIND(\"]\",CELL(\"filename\",Sheet1!$A$15))+1,31)&\"!\"&ADDRESS(MATCH(Sheet8!$D$9,Sheet1!C:C,0)+1,3,4)),ROW(B6)-1+SUM($B$14:$D$14),0))","v":200},1]
[null,{"$f":"IF(ROW(B7)-1>=$B$14,\"\",OFFSET(INDIRECT(MID(CELL(\"filename\",Sheet1!$A$15),FIND(\"]\",CELL(\"filename\",Sheet1!$A$15))+1,31)&\"!\"&ADDRESS(MATCH(Sheet8!$D$9,Sheet1!C:C,0)+1,3,4)),ROW(B7)-1,0))","v":""},{"$f":"IF(ROW(B7)-1>=$C$14,\"\",OFFSET(INDIRECT(MID(CELL(\"filename\",Sheet1!$A$15),FIND(\"]\",CELL(\"filename\",Sheet1!$A$15))+1,31)&\"!\"&ADDRESS(MATCH(Sheet8!$D$9,Sheet1!C:C,0)+1,3,4)),ROW(B7)-1+SUM($B$14:$B$14),0))","v":""},{"$f":"IF(ROW(B7)-1>=$D$14,\"\",OFFSET(INDIRECT(MID(CELL(\"filename\",Sheet1!$A$15),FIND(\"]\",CELL(\"filename\",Sheet1!$A$15))+1,31)&\"!\"&ADDRESS(MATCH(Sheet8!$D$9,Sheet1!C:C,0)+1,3,4)),ROW(B7)-1+SUM($B$14:$C$14),0))","v":""},{"$f":"IF(ROW(B7)-1>=$E$14,\"\",OFFSET(INDIRECT(MID(CELL(\"filename\",Sheet1!$A$15),FIND(\"]\",CELL(\"filename\",Sheet1!$A$15))+1,31)&\"!\"&ADDRESS(MATCH(Sheet8!$D$9,Sheet1!C:C,0)+1,3,4)),ROW(B7)-1+SUM($B$14:$D$14),0))","v":1100},1]
[null,{"$f":"IF(ROW(B8)-1>=$B$14,\"\",OFFSET(INDIRECT(MID(CELL(\"filename\",Sheet1!$A$15),FIND(\"]\",CELL(\"filename\",Sheet1!$A$15))+1,31)&\"!\"&ADDRESS(MATCH(Sheet8!$D$9,Sheet1!C:C,0)+1,3,4)),ROW(B8)-1,0))","v":""},{"$f":"IF(ROW(B8)-1>=$C$14,\"\",OFFSET(INDIRECT(MID(CELL(\"filename\",Sheet1!$A$15),FIND(\"]\",CELL(\"filename\",Sheet1!$A$15))+1,31)&\"!\"&ADDRESS(MATCH(Sheet8!$D$9,Sheet1!C:C,0)+1,3,4)),ROW(B8)-1+SUM($B$14:$B$14),0))","v":""},{"$f":"IF(ROW(B8)-1>=$D$14,\"\",OFFSET(INDIRECT(MID(CELL(\"filename\",Sheet1!$A$15),FIND(\"]\",CELL(\"filename\",Sheet1!$A$15))+1,31)&\"!\"&ADDRESS(MATCH(Sheet8!$D$9,Sheet1!C:C,0)+1,3,4)),ROW(B8)-1+SUM($B$14:$C$14),0))","v":""},{"$f":"IF(ROW(B8)-1>=$E$14,\"\",OFFSET(INDIRECT(MID(CELL(\"filename\",Sheet1!$A$15),FIND(\"]\",CELL(\"filename\",Sheet1!$A$15))+1,31)&\"!\"&ADDRESS(MATCH(Sheet8!$D$9,Sheet1!C:C,0)+1,3,4)),ROW(B8)-1+SUM($B$14:$D$14),0))","v":2100},1]
[null,{"$f":"IF(ROW(B9)-1>=$B$14,\"\",OFFSET(INDIRECT(MID(CELL(\"filename\",Sheet1!$A$15),FIND(\"]\",CELL(\"filename\",Sheet1!$A$15))+1,31)&\"!\"&ADDRESS(MATCH(Sheet8!$D$9,Sheet1!C:C,0)+1,3,4)),ROW(B9)-1,0))","v":""},{"$f":"IF(ROW(B9)-1>=$C$14,\"\",OFFSET(INDIRECT(MID(CELL(\"filename\",Sheet1!$A$15),FIND(\"]\",CELL(\"filename\",Sheet1!$A$15))+1,31)&\"!\"&ADDRESS(MATCH(Sheet8!$D$9,Sheet1!C:C,0)+1,3,4)),ROW(B9)-1+SUM($B$14:$B$14),0))","v":""},{"$f":"IF(ROW(B9)-1>=$D$14,\"\",OFFSET(INDIRECT(MID(CELL(\"filename\",Sheet1!$A$15),FIND(\"]\",CELL(\"filename\",Sheet1!$A$15))+1,31)&\"!\"&ADDRESS(MATCH(Sheet8!$D$9,Sheet1!C:C,0)+1,3,4)),ROW(B9)-1+SUM($B$14:$C$14),0))","v":""},{"$f":"IF(ROW(B9)-1>=$E$14,\"\",OFFSET(INDIRECT(MID(CELL(\"filename\",Sheet1!$A$15),FIND(\"]\",CELL(\"filename\",Sheet1!$A$15))+1,31)&\"!\"&ADDRESS(MATCH(Sheet8!$D$9,Sheet1!C:C,0)+1,3,4)),ROW(B9)-1+SUM($B$14:$D$14),0))","v":201},1]
[null,{"$f":"IF(ROW(B10)-1>=$B$14,\"\",OFFSET(INDIRECT(MID(CELL(\"filename\",Sheet1!$A$15),FIND(\"]\",CELL(\"filename\",Sheet1!$A$15))+1,31)&\"!\"&ADDRESS(MATCH(Sheet8!$D$9,Sheet1!C:C,0)+1,3,4)),ROW(B10)-1,0))","v":""},{"$f":"IF(ROW(B10)-1>=$C$14,\"\",OFFSET(INDIRECT(MID(CELL(\"filename\",Sheet1!$A$15),FIND(\"]\",CELL(\"filename\",Sheet1!$A$15))+1,31)&\"!\"&ADDRESS(MATCH(Sheet8!$D$9,Sheet1!C:C,0)+1,3,4)),ROW(B10)-1+SUM($B$14:$B$14),0))","v":""},{"$f":"IF(ROW(B10)-1>=$D$14,\"\",OFFSET(INDIRECT(MID(CELL(\"filename\",Sheet1!$A$15),FIND(\"]\",CELL(\"filename\",Sheet1!$A$15))+1,31)&\"!\"&ADDRESS(MATCH(Sheet8!$D$9,Sheet1!C:C,0)+1,3,4)),ROW(B10)-1+SUM($B$14:$C$14),0))","v":""},{"$f":"IF(ROW(B10)-1>=$E$14,\"\",OFFSET(INDIRECT(MID(CELL(\"filename\",Sheet1!$A$15),FIND(\"]\",CELL(\"filename\",Sheet1!$A$15))+1,31)&\"!\"&ADDRESS(MATCH(Sheet8!$D$9,Sheet1!C:C,0)+1,3,4)),ROW(B10)-1+SUM($B$14:$D$14),0))","v":1101},1]
[null,{"$f":"IF(ROW(B11)-1>=$B$14,\"\",OFFSET(INDIRECT(MID(CELL(\"filename\",Sheet1!$A$15),FIND(\"]\",CELL(\"filename\",Sheet1!$A$15))+1,31)&\"!\"&ADDRESS(MATCH(Sheet8!$D$9,Sheet1!C:C,0)+1,3,4)),ROW(B11)-1,0))","v":""},{"$f":"IF(ROW(B11)-1>=$C$14,\"\",OFFSET(INDIRECT(MID(CELL(\"filename\",Sheet1!$A$15),FIND(\"]\",CELL(\"filename\",Sheet1!$A$15))+1,31)&\"!\"&ADDRESS(MATCH(Sheet8!$D$9,Sheet1!C:C,0)+1,3,4)),ROW(B11)-1+SUM($B$14:$B$14),0))","v":""},{"$f":"IF(ROW(B11)-1>=$D$14,\"\",OFFSET(INDIRECT(MID(CELL(\"filename\",Sheet1!$A$15),FIND(\"]\",CELL(\"filename\",Sheet1!$A$15))+1,31)&\"!\"&ADDRESS(MATCH(Sheet8!$D$9,Sheet1!C:C,0)+1,3,4)),ROW(B11)-1+SUM($B$14:$C$14),0))","v":""},{"$f":"IF(ROW(B11)-1>=$E$14,\"\",OFFSET(INDIRECT(MID(CELL(\"filename\",Sheet1!$A$15),FIND(\"]\",CELL(\"filename\",Sheet1!$A$15))+1,31)&\"!\"&ADDRESS(MATCH(Sheet8!$D$9,Sheet1!C:C,0)+1,3,4)),ROW(B11)-1+SUM($B$14:$D$14),0))","v":2101},1]
[null,{"$f":"IF(ROW(B12)-1>=$B$14,\"\",OFFSET(INDIRECT(MID(CELL(\"filename\",Sheet1!$A$15),FIND(\"]\",CELL(\"filename\",Sheet1!$A$15))+1,31)&\"!\"&ADDRESS(MATCH(Sheet8!$D$9,Sheet1!C:C,0)+1,3,4)),ROW(B12)-1,0))","v":""},{"$f":"IF(ROW(B12)-1>=$C$14,\"\",OFFSET(INDIRECT(MID(CELL(\"filename\",Sheet1!$A$15),FIND(\"]\",CELL(\"filename\",Sheet1!$A$15))+1,31)&\"!\"&ADDRESS(MATCH(Sheet8!$D$9,Sheet1!C:C,0)+1,3,4)),ROW(B12)-1+SUM($B$14:$B$14),0))","v":""},{"$f":"IF(ROW(B12)-1>=$D$14,\"\",OFFSET(INDIRECT(MID(CELL(\"filename\",Sheet1!$A$15),FIND(\"]\",CELL(\"filename\",Sheet1!$A$15))+1,31)&\"!\"&ADDRESS(MATCH(Sheet8!$D$9,Sheet1!C:C,0)+1,3,4)),ROW(B12)-1+SUM($B$14:$C$14),0))","v":""},{"$f":"IF(ROW(B12)-1>=$E$14,\"\",OFFSET(INDIRECT(MID(CELL(\"filename\",Sheet1!$A$15),FIND(\"]\",CELL(\"filename\",Sheet1!$A$15))+1,31)&\"!\"&ADDRESS(MATCH(Sheet8!$D$9,Sheet1!C:C,0)+1,3,4)),ROW(B12)-1+SUM($B$14:$D$14),0))","v":""},""]
[null,{"$f":"IF(ROW(B13)-1>=$B$14,\"\",OFFSET(INDIRECT(MID(CELL(\"filename\",Sheet1!$A$15),FIND(\"]\",CELL(\"filename\",Sheet1!$A$15))+1,31)&\"!\"&ADDRESS(MATCH(Sheet8!$D$9,Sheet1!C:C,0)+1,3,4)),ROW(B13)-1,0))","v":""},{"$f":"IF(ROW(B13)-1>=$C$14,\"\",OFFSET(INDIRECT(MID(CELL(\"filename\",Sheet1!$A$15),FIND(\"]\",CELL(\"filename\",Sheet1!$A$15))+1,31)&\"!\"&ADDRESS(MATCH(Sheet8!$D$9,Sheet1!C:C,0)+1,3,4)),ROW(B13)-1+SUM($B$14:$B$14),0))","v":""},{"$f":"IF(ROW(B13)-1>=$D$14,\"\",OFFSET(INDIRECT(MID(CELL(\"filename\",Sheet1!$A$15),FIND(\"]\",CELL(\"filename\",Sheet1!$A$15))+1,31)&\"!\"&ADDRESS(MATCH(Sheet8!$D$9,Sheet1!C:C,0)+1,3,4)),ROW(B13)-1+SUM($B$14:$C$14),0))","v":""},{"$f":"IF(ROW(B13)-1>=$E$14,\"\",OFFSET(INDIRECT(MID(CELL(\"filename\",Sheet1!$A$15),FIND(\"]\",CELL(\"filename\",Sheet1!$A$15))+1,31)&\"!\"&ADDRESS(MATCH(Sheet8!$D$9,Sheet1!C:C,0)+1,3,4)),ROW(B13)-1+SUM($B$14:$D$14),0))","v":""},""]
[null,{"$f":"IF(ROW(B14)-1>=$B$14,\"\",OFFSET(INDIRECT(MID(CELL(\"filename\",Sheet1!$A$15),FIND(\"]\",CELL(\"filename\",Sheet1!$A$15))+1,31)&\"!\"&ADDRESS(MATCH(Sheet8!$D$9,Sheet1!C:C,0)+1,3,4)),ROW(B14)-1,0))","v":""},{"$f":"IF(ROW(B14)-1>=$C$14,\"\",OFFSET(INDIRECT(MID(CELL(\"filename\",Sheet1!$A$15),FIND(\"]\",CELL(\"filename\",Sheet1!$A$15))+1,31)&\"!\"&ADDRESS(MATCH(Sheet8!$D$9,Sheet1!C:C,0)+1,3,4)),ROW(B14)-1+SUM($B$14:$B$14),0))","v":""},{"$f":"IF(ROW(B14)-1>=$D$14,\"\",OFFSET(INDIRECT(MID(CELL(\"filename\",Sheet1!$A$15),FIND(\"]\",CELL(\"filename\",Sheet1!$A$15))+1,31)&\"!\"&ADDRESS(MATCH(Sheet8!$D$9,Sheet1!C:C,0)+1,3,4)),ROW(B14)-1+SUM($B$14:$C$14),0))","v":""},{"$f":"IF(ROW(B14)-1>=$E$14,\"\",OFFSET(INDIRECT(MID(CELL(\"filename\",Sheet1!$A$15),FIND(\"]\",CELL(\"filename\",Sheet1!$A$15))+1,31)&\"!\"&ADDRESS(MATCH(Sheet8!$D$9,Sheet1!C:C,0)+1,3,4)),ROW(B14)-1+SUM($B$14:$D$14),0))","v":""},""]
[null,{"$f":"IF(ROW(B15)-1>=$B$14,\"\",OFFSET(INDIRECT(MID(CELL(\"filename\",Sheet1!$A$15),FIND(\"]\",CELL(\"filename\",Sheet1!$A$15))+1,31)&\"!\"&ADDRESS(MATCH(Sheet8!$D$9,Sheet1!C:C,0)+1,3,4)),ROW(B15)-1,0))","v":""},{"$f":"IF(ROW(B15)-1>=$C$14,\"\",OFFSET(INDIRECT(MID(CELL(\"filename\",Sheet1!$A$15),FIND(\"]\",CELL(\"filename\",Sheet1!$A$15))+1,31)&\"!\"&ADDRESS(MATCH(Sheet8!$D$9,Sheet1!C:C,0)+1,3,4)),ROW(B15)-1+SUM($B$14:$B$14),0))","v":""},{"$f":"IF(ROW(B15)-1>=$D$14,\"\",OFFSET(INDIRECT(MID(CELL(\"filename\",Sheet1!$A$15),FIND(\"]\",CELL(\"filename\",Sheet1!$A$15))+1,31)&\"!\"&ADDRESS(MATCH(Sheet8!$D$9,Sheet1!C:C,0)+1,3,4)),ROW(B15)-1+SUM($B$14:$C$14),0))","v":""},{"$f":"IF(ROW(B15)-1>=$E$14,\"\",OFFSET(INDIRECT(MID(CELL(\"filename\",Sheet1!$A$15),FIND(\"]\",CELL(\"filename\",Sheet1!$A$15))+1,31)&\"!\"&ADDRESS(MATCH(Sheet8!$D$9,Sheet1!C:C,0)+1,3,4)),ROW(B15)-1+SUM($B$14:$D$14),0))","v":""},""]
[null,{"$f":"IF(ROW(B16)-1>=$B$14,\"\",OFFSET(INDIRECT(MID(CELL(\"filename\",Sheet1!$A$15),FIND(\"]\",CELL(\"filename\",Sheet1!$A$15))+1,31)&\"!\"&ADDRESS(MATCH(Sheet8!$D$9,Sheet1!C:C,0)+1,3,4)),ROW(B16)-1,0))","v":""},{"$f":"IF(ROW(B16)-1>=$C$14,\"\",OFFSET(INDIRECT(MID(CELL(\"filename\",Sheet1!$A$15),FIND(\"]\",CELL(\"filename\",Sheet1!$A$15))+1,31)&\"!\"&ADDRESS(MATCH(Sheet8!$D$9,Sheet1!C:C,0)+1,3,4)),ROW(B16)-1+SUM($B$14:$B$14),0))","v":""},{"$f":"IF(ROW(B16)-1>=$D$14,\"\",OFFSET(INDIRECT(MID(CELL(\"filename\",Sheet1!$A$15),FIND(\"]\",CELL(\"filename\",Sheet1!$A$15))+1,31)&\"!\"&ADDRESS(MATCH(Sheet8!$D$9,Sheet1!C:C,0)+1,3,4)),ROW(B16)-1+SUM($B$14:$C$14),0))","v":""},{"$f":"IF(ROW(B16)-1>=$E$14,\"\",OFFSET(INDIRECT(MID(CELL(\"filename\",Sheet1!$A$15),FIND(\"]\",CELL(\"filename\",Sheet1!$A$15))+1,31)&\"!\"&ADDRESS(MATCH(Sheet8!$D$9,Sheet1!C:C,0)+1,3,4)),ROW(B16)-1+SUM($B$14:$D$14),0))","v":""},""]
[null,{"$f":"IF(ROW(B17)-1>=$B$14,\"\",OFFSET(INDIRECT(MID(CELL(\"filename\",Sheet1!$A$15),FIND(\"]\",CELL(\"filename\",Sheet1!$A$15))+1,31)&\"!\"&ADDRESS(MATCH(Sheet8!$D$9,Sheet1!C:C,0)+1,3,4)),ROW(B17)-1,0))","v":""},{"$f":"IF(ROW(B17)-1>=$C$14,\"\",OFFSET(INDIRECT(MID(CELL(\"filename\",Sheet1!$A$15),FIND(\"]\",CELL(\"filename\",Sheet1!$A$15))+1,31)&\"!\"&ADDRESS(MATCH(Sheet8!$D$9,Sheet1!C:C,0)+1,3,4)),ROW(B17)-1+SUM($B$14:$B$14),0))","v":""},{"$f":"IF(ROW(B17)-1>=$D$14,\"\",OFFSET(INDIRECT(MID(CELL(\"filename\",Sheet1!$A$15),FIND(\"]\",CELL(\"filename\",Sheet1!$A$15))+1,31)&\"!\"&ADDRESS(MATCH(Sheet8!$D$9,Sheet1!C:C,0)+1,3,4)),ROW(B17)-1+SUM($B$14:$C$14),0))","v":""},{"$f":"IF(ROW(B17)-1>=$E$14,\"\",OFFSET(INDIRECT(MID(CELL(\"filename\",Sheet1!$A$15),FIND(\"]\",CELL(\"filename\",Sheet1!$A$15))+1,31)&\"!\"&ADDRESS(MATCH(Sheet8!$D$9,Sheet1!C:C,0)+1,3,4)),ROW(B17)-1+SUM($B$14:$D$14),0))","v":""},""]
[null,{"$f":"IF(ROW(B18)-1>=$B$14,\"\",OFFSET(INDIRECT(MID(CELL(\"filename\",Sheet1!$A$15),FIND(\"]\",CELL(\"filename\",Sheet1!$A$15))+1,31)&\"!\"&ADDRESS(MATCH(Sheet8!$D$9,Sheet1!C:C,0)+1,3,4)),ROW(B18)-1,0))","v":""},{"$f":"IF(ROW(B18)-1>=$C$14,\"\",OFFSET(INDIRECT(MID(CELL(\"filename\",Sheet1!$A$15),FIND(\"]\",CELL(\"filename\",Sheet1!$A$15))+1,31)&\"!\"&ADDRESS(MATCH(Sheet8!$D$9,Sheet1!C:C,0)+1,3,4)),ROW(B18)-1+SUM($B$14:$B$14),0))","v":""},{"$f":"IF(ROW(B18)-1>=$D$14,\"\",OFFSET(INDIRECT(MID(CELL(\"filename\",Sheet1!$A$15),FIND(\"]\",CELL(\"filename\",Sheet1!$A$15))+1,31)&\"!\"&ADDRESS(MATCH(Sheet8!$D$9,Sheet1!C:C,0)+1,3,4)),ROW(B18)-1+SUM($B$14:$C$14),0))","v":""},{"$f":"IF(ROW(B18)-1>=$E$14,\"\",OFFSET(INDIRECT(MID(CELL(\"filename\",Sheet1!$A$15),FIND(\"]\",CELL(\"filename\",Sheet1!$A$15))+1,31)&\"!\"&ADDRESS(MATCH(Sheet8!$D$9,Sheet1!C:C,0)+1,3,4)),ROW(B18)-1+SUM($B$14:$D$14),0))","v":""},""]
[null,{"$f":"IF(ROW(B19)-1>=$B$14,\"\",OFFSET(INDIRECT(MID(CELL(\"filename\",Sheet1!$A$15),FIND(\"]\",CELL(\"filename\",Sheet1!$A$15))+1,31)&\"!\"&ADDRESS(MATCH(Sheet8!$D$9,Sheet1!C:C,0)+1,3,4)),ROW(B19)-1,0))","v":""},{"$f":"IF(ROW(B19)-1>=$C$14,\"\",OFFSET(INDIRECT(MID(CELL(\"filename\",Sheet1!$A$15),FIND(\"]\",CELL(\"filename\",Sheet1!$A$15))+1,31)&\"!\"&ADDRESS(MATCH(Sheet8!$D$9,Sheet1!C:C,0)+1,3,4)),ROW(B19)-1+SUM($B$14:$B$14),0))","v":""},{"$f":"IF(ROW(B19)-1>=$D$14,\"\",OFFSET(INDIRECT(MID(CELL(\"filename\",Sheet1!$A$15),FIND(\"]\",CELL(\"filename\",Sheet1!$A$15))+1,31)&\"!\"&ADDRESS(MATCH(Sheet8!$D$9,Sheet1!C:C,0)+1,3,4)),ROW(B19)-1+SUM($B$14:$C$14),0))","v":""},{"$f":"IF(ROW(B19)-1>=$E$14,\"\",OFFSET(INDIRECT(MID(CELL(\"filename\",Sheet1!$A$15),FIND(\"]\",CELL(\"filename\",Sheet1!$A$15))+1,31)&\"!\"&ADDRESS(MATCH(Sheet8!$D$9,Sheet1!C:C,0)+1,3,4)),ROW(B19)-1+SUM($B$14:$D$14),0))","v":""},""]
[null,{"$f":"IF(ROW(B20)-1>=$B$14,\"\",OFFSET(INDIRECT(MID(CELL(\"filename\",Sheet1!$A$15),FIND(\"]\",CELL(\"filename\",Sheet1!$A$15))+1,31)&\"!\"&ADDRESS(MATCH(Sheet8!$D$9,Sheet1!C:C,0)+1,3,4)),ROW(B20)-1,0))","v":""},{"$f":"IF(ROW(B20)-1>=$C$14,\"\",OFFSET(INDIRECT(MID(CELL(\"filename\",Sheet1!$A$15),FIND(\"]\",CELL(\"filename\",Sheet1!$A$15))+1,31)&\"!\"&ADDRESS(MATCH(Sheet8!$D$9,Sheet1!C:C,0)+1,3,4)),ROW(B20)-1+SUM($B$14:$B$14),0))","v":""},{"$f":"IF(ROW(B20)-1>=$D$14,\"\",OFFSET(INDIRECT(MID(CELL(\"filename\",Sheet1!$A$15),FIND(\"]\",CELL(\"filename\",Sheet1!$A$15))+1,31)&\"!\"&ADDRESS(MATCH(Sheet8!$D$9,Sheet1!C:C,0)+1,3,4)),ROW(B20)-1+SUM($B$14:$C$14),0))","v":""},{"$f":"IF(ROW(B20)-1>=$E$14,\"\",OFFSET(INDIRECT(MID(CELL(\"filename\",Sheet1!$A$15),FIND(\"]\",CELL(\"filename\",Sheet1!$A$15))+1,31)&\"!\"&ADDRESS(MATCH(Sheet8!$D$9,Sheet1!C:C,0)+1,3,4)),ROW(B20)-1+SUM($B$14:$D$14),0))","v":""},""]
[]
[null,"परीक्षा प्रभारी",null,null,"केन्द्राधीक्षक "]
[null,{"$f":"Sheet2!$B$37","v":"XYZ (Lecturer)"},null,null,{"$f":"Sheet2!$E$37","v":"XYZ (Principal)"}]

{"sheet":"Sheet10","index":9,"n_rows":37,"n_cols":6,"rows_kept":37,"merged":[[0,1,0,4],[1,1,1,4],[2,1,2,4],[3,1,3,4],[4,1,4,4],[5,1,5,4],[7,1,7,4],[8,1,8,2],[8,3,8,4],[9,1,9,4],[10,1,10,4],[11,1,11,4]]}
[null,{"$f":"Sheet2!$B$1","v":"Half Yearly Examination 2024"}]
[null,"परीक्षा केंद्र नाम एवं परीक्षा केंद्र क्रमांक"]
[null,{"$f":"Sheet2!$B$3","v":"Govt Sr Sc School Malutana (216405)"}]
[null,"परीक्षा कक्ष / हॉल क्रमांक"]
[null,{"$f":"Sheet2!$K$9","v":{"v":9,"d":"09"}}]
[null,"परीक्षा दिनांक (दिवस) ... से ... तक"]
[null,{"$f":"Sheet2!$B$7","v":"14-12-2024"},{"$f":"IF(B7=\"\",\"\",TEXT(B7,\"DDDD\"))","v":"Saturday"},{"$f":"Sheet2!$D$7","v":"24-12-2024"},{"$f":"IF(D7=\"\",\"\",TEXT(D7,\"DDDD\"))","v":"Tuesday"}]
[null,"परीक्षार्थी रोल नंबर ... से ... तक"]
[null,{"$f":"IF(B14>0,B15,IF(C14>0,C15,IF(D14>0,D15,IF(E14>0,E15,0))))","v":202},null,{"$f":"IF(E14>0,LOOKUP(2,1/(E15:E34<>\"\"),E15:E34),IF(D14>0,LOOKUP(2,1/(D15:D34<>\"\"),D15:D34),IF(C14>0,LOOKUP(2,1/(C15:C34<>\"\"),C15:C34),IF(B14>0,LOOKUP(2,1/(B15:B34<>\"\"),B15:B34),0))))","v":2108}]
[null,"कुल सम्मिलित परीक्षार्थी "]
[null,{"$f":"COUNTIF($B$15:$E$34,\">0\")","v":21}]
[null,"परीक्षार्थी बैठक व्यवस्था"]
[null,"पंक्ति 1","पंक्ति 2","पंक्ति 3","पंक्ति 4"]
[null,{"$f":"Sheet2!L9","v":6},{"$f":"Sheet2!M9","v":5},{"$f":"Sheet2!N9","v":5},{"$f":"Sheet2!O9","v":5}]
[null,{"$f":"IF(ROW(B1)-1>=$B$14,\"\",OFFSET(INDIRECT(MID(CELL(\"filename\",Sheet1!$A$15),FIND(\"]\",CELL(\"filename\",Sheet1!$A$15))+1,31)&\"!\"&ADDRESS(MATCH(Sheet9!$D$9,Sheet1!C:C,0)+1,3,4)),ROW(B1)-1,0))","v":202},{"$f":"IF(ROW(B1)-1>=$C$14,\"\",OFFSET(INDIRECT(MID(CELL(\"filename\",Sheet1!$A$15),FIND(\"]\",CELL(\"filename\",Sheet1!$A$15))+1,31)&\"!\"&ADDRESS(MATCH(Sheet9!$D$9,Sheet1!C:C,0)+1,3,4)),ROW(B1)-1+SUM($B$14:$B$14),0))","v":204},{"$f":"IF(ROW(B1)-1>=$D$14,\"\",OFFSET(INDIRECT(MID(CELL(\"filename\",Sheet1!$A$15),FIND(\"]\",CELL(\"filename\",Sheet1!$A$15))+1,31)&\"!\"&ADDRESS(MATCH(Sheet9!$D$9,Sheet1!C:C,0)+1,3,4)),ROW(B1)-1+SUM($B$14:$C$14),0))","v":2105},{"$f":"IF(ROW(B1)-1>=$E$14,\"\",OFFSET(INDIRECT(MID(CELL(\"filename\",Sheet1!$A$15),FIND(\"]\",CELL(\"filename\",Sheet1!$A$15))+1,31)&\"!\"&ADDRESS(MATCH(Sheet9!$D$9,Sheet1!C:C,0)+1,3,4)),ROW(B1)-1+SUM($B$14:$D$14),0))","v":1107},{"$f":"IF(SUM(B15:E15)>0,1,\"\")","v":1}]
[null,{"$f":"IF(ROW(B2)-1>=$B$14,\"\",OFFSET(INDIRECT(MID(CELL(\"filename\",Sheet1!$A$15),FIND(\"]\",CELL(\"filename\",Sheet1!$A$15))+1,31)&\"!\"&ADDRESS(MATCH(Sheet9!$D$9,Sheet1!C:C,0)+1,3,4)),ROW(B2)-1,0))","v":1102},{"$f":"IF(ROW(B2)-1>=$C$14,\"\",OFFSET(INDIRECT(MID(CELL(\"filename\",Sheet1!$A$15),FIND(\"]\",CELL(\"filename\",Sheet1!$A$15))+1,31)&\"!\"&ADDRESS(MATCH(Sheet9!$D$9,Sheet1!C:C,0)+1,3,4)),ROW(B2)-1+SUM($B$14:$B$14),0))","v":1104},{"$f":"IF(ROW(B2)-1>=$D$14,\"\",OFFSET(INDIRECT(MID(CELL(\"filename\",Sheet1!$A$15),FIND(\"]\",CELL(\"filename\",Sheet1!$A$15))+1,31)&\"!\"&ADDRESS(MATCH(Sheet9!$D$9,Sheet1!C:C,0)+1,3,4)),ROW(B2)-1+SUM($B$14:$C$14),0))","v":206},{"$f":"IF(ROW(B2)-1>=$E$14,\"\",OFFSET(INDIRECT(MID(CELL(\"filename\",Sheet1!$A$15),FIND(\"]\",CELL(\"filename\",Sheet1!$A$15))+1,31)&\"!\"&ADDRESS(MATCH(Sheet9!$D$9,Sheet1!C:C,0)+1,3,4)),ROW(B2)-1+SUM($B$14:$D$14),0))","v":2107},{"$f":"IF(SUM(B16:E16)>0,1,\"\")","v":1}]
[null,{"$f":"IF(ROW(B3)-1>=$B$14,\"\",OFFSET(INDIRECT(MID(CELL(\"filename\",Sheet1!$A$15),FIND(\"]\",CELL(\"filename\",Sheet1!$A$15))+1,31)&\"!\"&ADDRESS(MATCH(Sheet9!$D$9,Sheet1!C:C,0)+1,3,4)),ROW(B3)-1,0))","v":2102},{"$f":"IF(ROW(B3)-1>=$C$14,\"\",OFFSET(INDIRECT(MID(CELL(\"filename\",Sheet1!$A$15),FIND(\"]\",CELL(\"filename\",Sheet1!$A$15))+1,31)&\"!\"&ADDRESS(MATCH(Sheet9!$D$9,Sheet1!C:C,0)+1,3,4)),ROW(B3)-1+SUM($B$14:$B$14),0))","v":2104},{"$f":"IF(ROW(B3)-1>=$D$14,\"\",OFFSET(INDIRECT(MID(CELL(\"filename\",Sheet1!$A$15),FIND(\"]\",CELL(\"filename\",Sheet1!$A$15))+1,31)&\"!\"&ADDRESS(MATCH(Sheet9!$D$9,Sheet1!C:C,0)+1,3,4)),ROW(B3)-1+SUM($B$14:$C$14),0))","v":1106},{"$f":"IF(ROW(B3)-1>=$E$14,\"\",OFFSET(INDIRECT(MID(CELL(\"filename\",Sheet1!$A$15),FIND(\"]\",CELL(\"filename\",Sheet1!$A$15))+1,31)&\"!\"&ADDRESS(MATCH(Sheet9!$D$9,Sheet1!C:C,0)+1,3,4)),ROW(B3)-1+SUM($B$14:$D$14),0))","v":208},1]
[null,{"$f":"IF(ROW(B4)-1>=$B$14,\"\",OFFSET(INDIRECT(MID(CELL(\"filename\",Sheet1!$A$15),FIND(\"]\",CELL(\"filename\",Sheet1!$A$15))+1,31)&\"!\"&ADDRESS(MATCH(Sheet9!$D$9,Sheet1!C:C,0)+1,3,4)),ROW(B4)-1,0))","v":203},{"$f":"IF(ROW(B4)-1>=$C$14,\"\",OFFSET(INDIRECT(MID(CELL(\"filename\",Sheet1!$A$15),FIND(\"]\",CELL(\"filename\",Sheet1!$A$15))+1,31)&\"!\"&ADDRESS(MATCH(Sheet9!$D$9,Sheet1!C:C,0)+1,3,4)),ROW(B4)-1+SUM($B$14:$B$14),0))","v":205},{"$f":"IF(ROW(B4)-1>=$D$14,\"\",OFFSET(INDIRECT(MID(CELL(\"filename\",Sheet1!$A$15),FIND(\"]\",CELL(\"filename\",Sheet1!$A$15))+1,31)&\"!\"&ADDRESS(MATCH(Sheet9!$D$9,Sheet1!C:C,0)+1,3,4)),ROW(B4)-1+SUM($B$14:$C$14),0))","v":2106},{"$f":"IF(ROW(B4)-1>=$E$14,\"\",OFFSET(INDIRECT(MID(CELL(\"filename\",Sheet1!$A$15),FIND(\"]\",CELL(\"filename\",Sheet1!$A$15))+1,31)&\"!\"&ADDRESS(MATCH(Sheet9!$D$9,Sheet1!C:C,0)+1,3,4)),ROW(B4)-1+SUM($B$14:$D$14),0))","v":1108},1]
[null,{"$f":"IF(ROW(B5)-1>=$B$14,\"\",OFFSET(INDIRECT(MID(CELL(\"filename\",Sheet1!$A$15),FIND(\"]\",CELL(\"filename\",Sheet1!$A$15))+1,31)&\"!\"&ADDRESS(MATCH(Sheet9!$D$9,Sheet1!C:C,0)+1,3,4)),ROW(B5)-1,0))","v":1103},{"$f":"IF(ROW(B5)-1>=$C$14,\"\",OFFSET(INDIRECT(MID(CELL(\"filename\",Sheet1!$A$15),FIND(\"]\",CELL(\"filename\",Sheet1!$A$15))+1,31)&\"!\"&ADDRESS(MATCH(Sheet9!$D$9,Sheet1!C:C,0)+1,3,4)),ROW(B5)-1+SUM($B$14:$B$14),0))","v":1105},{"$f":"IF(ROW(B5)-1>=$D$14,\"\",OFFSET(INDIRECT(MID(CELL(\"filename\",Sheet1!$A$15),FIND(\"]\",CELL(\"filename\",Sheet1!$A$15))+1,31)&\"!\"&ADDRESS(MATCH(Sheet9!$D$9,Sheet1!C:C,0)+1,3,4)),ROW(B5)-1+SUM($B$14:$C$14),0))","v":207},{"$f":"IF(ROW(B5)-1>=$E$14,\"\",OFFSET(INDIRECT(MID(CELL(\"filename\",Sheet1!$A$15),FIND(\"]\",CELL(\"filename\",Sheet1!$A$15))+1,31)&\"!\"&ADDRESS(MATCH(Sheet9!$D$9,Sheet1!C:C,0)+1,3,4)),ROW(B5)-1+SUM($B$14:$D$14),0))","v":2108},1]
[null,{"$f":"IF(ROW(B6)-1>=$B$14,\"\",OFFSET(INDIRECT(MID(CELL(\"filename\",Sheet1!$A$15),FIND(\"]\",CELL(\"filename\",Sheet1!$A$15))+1,31)&\"!\"&ADDRESS(MATCH(Sheet9!$D$9,Sheet1!C:C,0)+1,3,4)),ROW(B6)-1,0))","v":2103},{"$f":"IF(ROW(B6)-1>=$C$14,\"\",OFFSET(INDIRECT(MID(CELL(\"filename\",Sheet1!$A$15),FIND(\"]\",CELL(\"filename\",Sheet1!$A$15))+1,31)&\"!\"&ADDRESS(MATCH(Sheet9!$D$9,Sheet1!C:C,0)+1,3,4)),ROW(B6)-1+SUM($B$14:$B$14),0))","v":""},{"$f":"IF(ROW(B6)-1>=$D$14,\"\",OFFSET(INDIRECT(MID(CELL(\"filename\",Sheet1!$A$15),FIND(\"]\",CELL(\"filename\",Sheet1!$A$15))+1,31)&\"!\"&ADDRESS(MATCH(Sheet9!$D$9,Sheet1!C:C,0)+1,3,4)),ROW(B6)-1+SUM($B$14:$C$14),0))","v":""},{"$f":"IF(ROW(B6)-1>=$E$14,\"\",OFFSET(INDIRECT(MID(CELL(\"filename\",Sheet1!$A$15),FIND(\"]\",CELL(\"filename\",Sheet1!$A$15))+1,31)&\"!\"&ADDRESS(MATCH(Sheet9!$D$9,Sheet1!C:C,0)+1,3,4)),ROW(B6)-1+SUM($B$14:$D$14),0))","v":""},1]
[null,{"$f":"IF(ROW(B7)-1>=$B$14,\"\",OFFSET(INDIRECT(MID(CELL(\"filename\",Sheet1!$A$15),FIND(\"]\",CELL(\"filename\",Sheet1!$A$15))+1,31)&\"!\"&ADDRESS(MATCH(Sheet9!$D$9,Sheet1!C:C,0)+1,3,4)),ROW(B7)-1,0))","v":""},{"$f":"IF(ROW(B7)-1>=$C$14,\"\",OFFSET(INDIRECT(MID(CELL(\"filename\",Sheet1!$A$15),FIND(\"]\",CELL(\"filename\",Sheet1!$A$15))+1,31)&\"!\"&ADDRESS(MATCH(Sheet9!$D$9,Sheet1!C:C,0)+1,3,4)),ROW(B7)-1+SUM($B$14:$B$14),0))","v":""},{"$f":"IF(ROW(B7)-1>=$D$14,\"\",OFFSET(INDIRECT(MID(CELL(\"filename\",Sheet1!$A$15),FIND(\"]\",CELL(\"filename\",Sheet1!$A$15))+1,31)&\"!\"&ADDRESS(MATCH(Sheet9!$D$9,Sheet1!C:C,0)+1,3,4)),ROW(B7)-1+SUM($B$14:$C$14),0))","v":""},{"$f":"IF(ROW(B7)-1>=$E$14,\"\",OFFSET(INDIRECT(MID(CELL(\"filename\",Sheet1!$A$15),FIND(\"]\",CELL(\"filename\",Sheet1!$A$15))+1,31)&\"!\"&ADDRESS(MATCH(Sheet9!$D$9,Sheet1!C:C,0)+1,3,4)),ROW(B7)-1+SUM($B$14:$D$14),0))","v":""},""]
[null,{"$f":"IF(ROW(B8)-1>=$B$14,\"\",OFFSET(INDIRECT(MID(CELL(\"filename\",Sheet1!$A$15),FIND(\"]\",CELL(\"filename\",Sheet1!$A$15))+1,31)&\"!\"&ADDRESS(MATCH(Sheet9!$D$9,Sheet1!C:C,0)+1,3,4)),ROW(B8)-1,0))","v":""},{"$f":"IF(ROW(B8)-1>=$C$14,\"\",OFFSET(INDIRECT(MID(CELL(\"filename\",Sheet1!$A$15),FIND(\"]\",CELL(\"filename\",Sheet1!$A$15))+1,31)&\"!\"&ADDRESS(MATCH(Sheet9!$D$9,Sheet1!C:C,0)+1,3,4)),ROW(B8)-1+SUM($B$14:$B$14),0))","v":""},{"$f":"IF(ROW(B8)-1>=$D$14,\"\",OFFSET(INDIRECT(MID(CELL(\"filename\",Sheet1!$A$15),FIND(\"]\",CELL(\"filename\",Sheet1!$A$15))+1,31)&\"!\"&ADDRESS(MATCH(Sheet9!$D$9,Sheet1!C:C,0)+1,3,4)),ROW(B8)-1+SUM($B$14:$C$14),0))","v":""},{"$f":"IF(ROW(B8)-1>=$E$14,\"\",OFFSET(INDIRECT(MID(CELL(\"filename\",Sheet1!$A$15),FIND(\"]\",CELL(\"filename\",Sheet1!$A$15))+1,31)&\"!\"&ADDRESS(MATCH(Sheet9!$D$9,Sheet1!C:C,0)+1,3,4)),ROW(B8)-1+SUM($B$14:$D$14),0))","v":""},""]
[null,{"$f":"IF(ROW(B9)-1>=$B$14,\"\",OFFSET(INDIRECT(MID(CELL(\"filename\",Sheet1!$A$15),FIND(\"]\",CELL(\"filename\",Sheet1!$A$15))+1,31)&\"!\"&ADDRESS(MATCH(Sheet9!$D$9,Sheet1!C:C,0)+1,3,4)),ROW(B9)-1,0))","v":""},{"$f":"IF(ROW(B9)-1>=$C$14,\"\",OFFSET(INDIRECT(MID(CELL(\"filename\",Sheet1!$A$15),FIND(\"]\",CELL(\"filename\",Sheet1!$A$15))+1,31)&\"!\"&ADDRESS(MATCH(Sheet9!$D$9,Sheet1!C:C,0)+1,3,4)),ROW(B9)-1+SUM($B$14:$B$14),0))","v":""},{"$f":"IF(ROW(B9)-1>=$D$14,\"\",OFFSET(INDIRECT(MID(CELL(\"filename\",Sheet1!$A$15),FIND(\"]\",CELL(\"filename\",Sheet1!$A$15))+1,31)&\"!\"&ADDRESS(MATCH(Sheet9!$D$9,Sheet1!C:C,0)+1,3,4)),ROW(B9)-1+SUM($B$14:$C$14),0))","v":""},{"$f":"IF(ROW(B9)-1>=$E$14,\"\",OFFSET(INDIRECT(MID(CELL(\"filename\",Sheet1!$A$15),FIND(\"]\",CELL(\"filename\",Sheet1!$A$15))+1,31)&\"!\"&ADDRESS(MATCH(Sheet9!$D$9,Sheet1!C:C,0)+1,3,4)),ROW(B9)-1+SUM($B$14:$D$14),0))","v":""},""]
[null,{"$f":"IF(ROW(B10)-1>=$B$14,\"\",OFFSET(INDIRECT(MID(CELL(\"filename\",Sheet1!$A$15),FIND(\"]\",CELL(\"filename\",Sheet1!$A$15))+1,31)&\"!\"&ADDRESS(MATCH(Sheet9!$D$9,Sheet1!C:C,0)+1,3,4)),ROW(B10)-1,0))","v":""},{"$f":"IF(ROW(B10)-1>=$C$14,\"\",OFFSET(INDIRECT(MID(CELL(\"filename\",Sheet1!$A$15),FIND(\"]\",CELL(\"filename\",Sheet1!$A$15))+1,31)&\"!\"&ADDRESS(MATCH(Sheet9!$D$9,Sheet1!C:C,0)+1,3,4)),ROW(B10)-1+SUM($B$14:$B$14),0))","v":""},{"$f":"IF(ROW(B10)-1>=$D$14,\"\",OFFSET(INDIRECT(MID(CELL(\"filename\",Sheet1!$A$15),FIND(\"]\",CELL(\"filename\",Sheet1!$A$15))+1,31)&\"!\"&ADDRESS(MATCH(Sheet9!$D$9,Sheet1!C:C,0)+1,3,4)),ROW(B10)-1+SUM($B$14:$C$14),0))","v":""},{"$f":"IF(ROW(B10)-1>=$E$14,\"\",OFFSET(INDIRECT(MID(CELL(\"filename\",Sheet1!$A$15),FIND(\"]\",CELL(\"filename\",Sheet1!$A$15))+1,31)&\"!\"&ADDRESS(MATCH(Sheet9!$D$9,Sheet1!C:C,0)+1,3,4)),ROW(B10)-1+SUM($B$14:$D$14),0))","v":""},""]
[null,{"$f":"IF(ROW(B11)-1>=$B$14,\"\",OFFSET(INDIRECT(MID(CELL(\"filename\",Sheet1!$A$15),FIND(\"]\",CELL(\"filename\",Sheet1!$A$15))+1,31)&\"!\"&ADDRESS(MATCH(Sheet9!$D$9,Sheet1!C:C,0)+1,3,4)),ROW(B11)-1,0))","v":""},{"$f":"IF(ROW(B11)-1>=$C$14,\"\",OFFSET(INDIRECT(MID(CELL(\"filename\",Sheet1!$A$15),FIND(\"]\",CELL(\"filename\",Sheet1!$A$15))+1,31)&\"!\"&ADDRESS(MATCH(Sheet9!$D$9,Sheet1!C:C,0)+1,3,4)),ROW(B11)-1+SUM($B$14:$B$14),0))","v":""},{"$f":"IF(ROW(B11)-1>=$D$14,\"\",OFFSET(INDIRECT(MID(CELL(\"filename\",Sheet1!$A$15),FIND(\"]\",CELL(\"filename\",Sheet1!$A$15))+1,31)&\"!\"&ADDRESS(MATCH(Sheet9!$D$9,Sheet1!C:C,0)+1,3,4)),ROW(B11)-1+SUM($B$14:$C$14),0))","v":""},{"$f":"IF(ROW(B11)-1>=$E$14,\"\",OFFSET(INDIRECT(MID(CELL(\"filename\",Sheet1!$A$15),FIND(\"]\",CELL(\"filename\",Sheet1!$A$15))+1,31)&\"!\"&ADDRESS(MATCH(Sheet9!$D$9,Sheet1!C:C,0)+1,3,4)),ROW(B11)-1+SUM($B$14:$D$14),0))","v":""},""]
[null,{"$f":"IF(ROW(B12)-1>=$B$14,\"\",OFFSET(INDIRECT(MID(CELL(\"filename\",Sheet1!$A$15),FIND(\"]\",CELL(\"filename\",Sheet1!$A$15))+1,31)&\"!\"&ADDRESS(MATCH(Sheet9!$D$9,Sheet1!C:C,0)+1,3,4)),ROW(B12)-1,0))","v":""},{"$f":"IF(ROW(B12)-1>=$C$14,\"\",OFFSET(INDIRECT(MID(CELL(\"filename\",Sheet1!$A$15),FIND(\"]\",CELL(\"filename\",Sheet1!$A$15))+1,31)&\"!\"&ADDRESS(MATCH(Sheet9!$D$9,Sheet1!C:C,0)+1,3,4)),ROW(B12)-1+SUM($B$14:$B$14),0))","v":""},{"$f":"IF(ROW(B12)-1>=$D$14,\"\",OFFSET(INDIRECT(MID(CELL(\"filename\",Sheet1!$A$15),FIND(\"]\",CELL(\"filename\",Sheet1!$A$15))+1,31)&\"!\"&ADDRESS(MATCH(Sheet9!$D$9,Sheet1!C:C,0)+1,3,4)),ROW(B12)-1+SUM($B$14:$C$14),0))","v":""},{"$f":"IF(ROW(B12)-1>=$E$14,\"\",OFFSET(INDIRECT(MID(CELL(\"filename\",Sheet1!$A$15),FIND(\"]\",CELL(\"filename\",Sheet1!$A$15))+1,31)&\"!\"&ADDRESS(MATCH(Sheet9!$D$9,Sheet1!C:C,0)+1,3,4)),ROW(B12)-1+SUM($B$14:$D$14),0))","v":""},""]
[null,{"$f":"IF(ROW(B13)-1>=$B$14,\"\",OFFSET(INDIRECT(MID(CELL(\"filename\",Sheet1!$A$15),FIND(\"]\",CELL(\"filename\",Sheet1!$A$15))+1,31)&\"!\"&ADDRESS(MATCH(Sheet9!$D$9,Sheet1!C:C,0)+1,3,4)),ROW(B13)-1,0))","v":""},{"$f":"IF(ROW(B13)-1>=$C$14,\"\",OFFSET(INDIRECT(MID(CELL(\"filename\",Sheet1!$A$15),FIND(\"]\",CELL(\"filename\",Sheet1!$A$15))+1,31)&\"!\"&ADDRESS(MATCH(Sheet9!$D$9,Sheet1!C:C,0)+1,3,4)),ROW(B13)-1+SUM($B$14:$B$14),0))","v":""},{"$f":"IF(ROW(B13)-1>=$D$14,\"\",OFFSET(INDIRECT(MID(CELL(\"filename\",Sheet1!$A$15),FIND(\"]\",CELL(\"filename\",Sheet1!$A$15))+1,31)&\"!\"&ADDRESS(MATCH(Sheet9!$D$9,Sheet1!C:C,0)+1,3,4)),ROW(B13)-1+SUM($B$14:$C$14),0))","v":""},{"$f":"IF(ROW(B13)-1>=$E$14,\"\",OFFSET(INDIRECT(MID(CELL(\"filename\",Sheet1!$A$15),FIND(\"]\",CELL(\"filename\",Sheet1!$A$15))+1,31)&\"!\"&ADDRESS(MATCH(Sheet9!$D$9,Sheet1!C:C,0)+1,3,4)),ROW(B13)-1+SUM($B$14:$D$14),0))","v":""},""]
[null,{"$f":"IF(ROW(B14)-1>=$B$14,\"\",OFFSET(INDIRECT(MID(CELL(\"filename\",Sheet1!$A$15),FIND(\"]\",CELL(\"filename\",Sheet1!$A$15))+1,31)&\"!\"&ADDRESS(MATCH(Sheet9!$D$9,Sheet1!C:C,0)+1,3,4)),ROW(B14)-1,0))","v":""},{"$f":"IF(ROW(B14)-1>=$C$14,\"\",OFFSET(INDIRECT(MID(CELL(\"filename\",Sheet1!$A$15),FIND(\"]\",CELL(\"filename\",Sheet1!$A$15))+1,31)&\"!\"&ADDRESS(MATCH(Sheet9!$D$9,Sheet1!C:C,0)+1,3,4)),ROW(B14)-1+SUM($B$14:$B$14),0))","v":""},{"$f":"IF(ROW(B14)-1>=$D$14,\"\",OFFSET(INDIRECT(MID(CELL(\"filename\",Sheet1!$A$15),FIND(\"]\",CELL(\"filename\",Sheet1!$A$15))+1,31)&\"!\"&ADDRESS(MATCH(Sheet9!$D$9,Sheet1!C:C,0)+1,3,4)),ROW(B14)-1+SUM($B$14:$C$14),0))","v":""},{"$f":"IF(ROW(B14)-1>=$E$14,\"\",OFFSET(INDIRECT(MID(CELL(\"filename\",Sheet1!$A$15),FIND(\"]\",CELL(\"filename\",Sheet1!$A$15))+1,31)&\"!\"&ADDRESS(MATCH(Sheet9!$D$9,Sheet1!C:C,0)+1,3,4)),ROW(B14)-1+SUM($B$14:$D$14),0))","v":""},""]
[null,{"$f":"IF(ROW(B15)-1>=$B$14,\"\",OFFSET(INDIRECT(MID(CELL(\"filename\",Sheet1!$A$15),FIND(\"]\",CELL(\"filename\",Sheet1!$A$15))+1,31)&\"!\"&ADDRESS(MATCH(Sheet9!$D$9,Sheet1!C:C,0)+1,3,4)),ROW(B15)-1,0))","v":""},{"$f":"IF(ROW(B15)-1>=$C$14,\"\",OFFSET(INDIRECT(MID(CELL(\"filename\",Sheet1!$A$15),FIND(\"]\",CELL(\"filename\",Sheet1!$A$15))+1,31)&\"!\"&ADDRESS(MATCH(Sheet9!$D$9,Sheet1!C:C,0)+1,3,4)),ROW(B15)-1+SUM($B$14:$B$14),0))","v":""},{"$f":"IF(ROW(B15)-1>=$D$14,\"\",OFFSET(INDIRECT(MID(CELL(\"filename\",Sheet1!$A$15),FIND(\"]\",CELL(\"filename\",Sheet1!$A$15))+1,31)&\"!\"&ADDRESS(MATCH(Sheet9!$D$9,Sheet1!C:C,0)+1,3,4)),ROW(B15)-1+SUM($B$14:$C$14),0))","v":""},{"$f":"IF(ROW(B15)-1>=$E$14,\"\",OFFSET(INDIRECT(MID(CELL(\"filename\",Sheet1!$A$15),FIND(\"]\",CELL(\"filename\",Sheet1!$A$15))+1,31)&\"!\"&ADDRESS(MATCH(Sheet9!$D$9,Sheet1!C:C,0)+1,3,4)),ROW(B15)-1+SUM($B$14:$D$14),0))","v":""},""]
[null,{"$f":"IF(ROW(B16)-1>=$B$14,\"\",OFFSET(INDIRECT(MID(CELL(\"filename\",Sheet1!$A$15),FIND(\"]\",CELL(\"filename\",Sheet1!$A$15))+1,31)&\"!\"&ADDRESS(MATCH(Sheet9!$D$9,Sheet1!C:C,0)+1,3,4)),ROW(B16)-1,0))","v":""},{"$f":"IF(ROW(B16)-1>=$C$14,\"\",OFFSET(INDIRECT(MID(CELL(\"filename\",Sheet1!$A$15),FIND(\"]\",CELL(\"filename\",Sheet1!$A$15))+1,31)&\"!\"&ADDRESS(MATCH(Sheet9!$D$9,Sheet1!C:C,0)+1,3,4)),ROW(B16)-1+SUM($B$14:$B$14),0))","v":""},{"$f":"IF(ROW(B16)-1>=$D$14,\"\",OFFSET(INDIRECT(MID(CELL(\"filename\",Sheet1!$A$15),FIND(\"]\",CELL(\"filename\",Sheet1!$A$15))+1,31)&\"!\"&ADDRESS(MATCH(Sheet9!$D$9,Sheet1!C:C,0)+1,3,4)),ROW(B16)-1+SUM($B$14:$C$14),0))","v":""},{"$f":"IF(ROW(B16)-1>=$E$14,\"\",OFFSET(INDIRECT(MID(CELL(\"filename\",Sheet1!$A$15),FIND(\"]\",CELL(\"filename\",Sheet1!$A$15))+1,31)&\"!\"&ADDRESS(MATCH(Sheet9!$D$9,Sheet1!C:C,0)+1,3,4)),ROW(B16)-1+SUM($B$14:$D$14),0))","v":""},""]
[null,{"$f":"IF(ROW(B17)-1>=$B$14,\"\",OFFSET(INDIRECT(MID(CELL(\"filename\",Sheet1!$A$15),FIND(\"]\",CELL(\"filename\",Sheet1!$A$15))+1,31)&\"!\"&ADDRESS(MATCH(Sheet9!$D$9,Sheet1!C:C,0)+1,3,4)),ROW(B17)-1,0))","v":""},{"$f":"IF(ROW(B17)-1>=$C$14,\"\",OFFSET(INDIRECT(MID(CELL(\"filename\",Sheet1!$A$15),FIND(\"]\",CELL(\"filename\",Sheet1!$A$15))+1,31)&\"!\"&ADDRESS(MATCH(Sheet9!$D$9,Sheet1!C:C,0)+1,3,4)),ROW(B17)-1+SUM($B$14:$B$14),0))","v":""},{"$f":"IF(ROW(B17)-1>=$D$14,\"\",OFFSET(INDIRECT(MID(CELL(\"filename\",Sheet1!$A$15),FIND(\"]\",CELL(\"filename\",Sheet1!$A$15))+1,31)&\"!\"&ADDRESS(MATCH(Sheet9!$D$9,Sheet1!C:C,0)+1,3,4)),ROW(B17)-1+SUM($B$14:$C$14),0))","v":""},{"$f":"IF(ROW(B17)-1>=$E$14,\"\",OFFSET(INDIRECT(MID(CELL(\"filename\",Sheet1!$A$15),FIND(\"]\",CELL(\"filename\",Sheet1!$A$15))+1,31)&\"!\"&ADDRESS(MATCH(Sheet9!$D$9,Sheet1!C:C,0)+1,3,4)),ROW(B17)-1+SUM($B$14:$D$14),0))","v":""},""]
[null,{"$f":"IF(ROW(B18)-1>=$B$14,\"\",OFFSET(INDIRECT(MID(CELL(\"filename\",Sheet1!$A$15),FIND(\"]\",CELL(\"filename\",Sheet1!$A$15))+1,31)&\"!\"&ADDRESS(MATCH(Sheet9!$D$9,Sheet1!C:C,0)+1,3,4)),ROW(B18)-1,0))","v":""},{"$f":"IF(ROW(B18)-1>=$C$14,\"\",OFFSET(INDIRECT(MID(CELL(\"filename\",Sheet1!$A$15),FIND(\"]\",CELL(\"filename\",Sheet1!$A$15))+1,31)&\"!\"&ADDRESS(MATCH(Sheet9!$D$9,Sheet1!C:C,0)+1,3,4)),ROW(B18)-1+SUM($B$14:$B$14),0))","v":""},{"$f":"IF(ROW(B18)-1>=$D$14,\"\",OFFSET(INDIRECT(MID(CELL(\"filename\",Sheet1!$A$15),FIND(\"]\",CELL(\"filename\",Sheet1!$A$15))+1,31)&\"!\"&ADDRESS(MATCH(Sheet9!$D$9,Sheet1!C:C,0)+1,3,4)),ROW(B18)-1+SUM($B$14:$C$14),0))","v":""},{"$f":"IF(ROW(B18)-1>=$E$14,\"\",OFFSET(INDIRECT(MID(CELL(\"filename\",Sheet1!$A$15),FIND(\"]\",CELL(\"filename\",Sheet1!$A$15))+1,31)&\"!\"&ADDRESS(MATCH(Sheet9!$D$9,Sheet1!C:C,0)+1,3,4)),ROW(B18)-1+SUM($B$14:$D$14),0))","v":""},""]
[null,{"$f":"IF(ROW(B19)-1>=$B$14,\"\",OFFSET(INDIRECT(MID(CELL(\"filename\",Sheet1!$A$15),FIND(\"]\",CELL(\"filename\",Sheet1!$A$15))+1,31)&\"!\"&ADDRESS(MATCH(Sheet9!$D$9,Sheet1!C:C,0)+1,3,4)),ROW(B19)-1,0))","v":""},{"$f":"IF(ROW(B19)-1>=$C$14,\"\",OFFSET(INDIRECT(MID(CELL(\"filename\",Sheet1!$A$15),FIND(\"]\",CELL(\"filename\",Sheet1!$A$15))+1,31)&\"!\"&ADDRESS(MATCH(Sheet9!$D$9,Sheet1!C:C,0)+1,3,4)),ROW(B19)-1+SUM($B$14:$B$14),0))","v":""},{"$f":"IF(ROW(B19)-1>=$D$14,\"\",OFFSET(INDIRECT(MID(CELL(\"filename\",Sheet1!$A$15),FIND(\"]\",CELL(\"filename\",Sheet1!$A$15))+1,31)&\"!\"&ADDRESS(MATCH(Sheet9!$D$9,Sheet1!C:C,0)+1,3,4)),ROW(B19)-1+SUM($B$14:$C$14),0))","v":""},{"$f":"IF(ROW(B19)-1>=$E$14,\"\",OFFSET(INDIRECT(MID(CELL(\"filename\",Sheet1!$A$15),FIND(\"]\",CELL(\"filename\",Sheet1!$A$15))+1,31)&\"!\"&ADDRESS(MATCH(Sheet9!$D$9,Sheet1!C:C,0)+1,3,4)),ROW(B19)-1+SUM($B$14:$D$14),0))","v":""},""]
[null,{"$f":"IF(ROW(B20)-1>=$B$14,\"\",OFFSET(INDIRECT(MID(CELL(\"filename\",Sheet1!$A$15),FIND(\"]\",CELL(\"filename\",Sheet1!$A$15))+1,31)&\"!\"&ADDRESS(MATCH(Sheet9!$D$9,Sheet1!C:C,0)+1,3,4)),ROW(B20)-1,0))","v":""},{"$f":"IF(ROW(B20)-1>=$C$14,\"\",OFFSET(INDIRECT(MID(CELL(\"filename\",Sheet1!$A$15),FIND(\"]\",CELL(\"filename\",Sheet1!$A$15))+1,31)&\"!\"&ADDRESS(MATCH(Sheet9!$D$9,Sheet1!C:C,0)+1,3,4)),ROW(B20)-1+SUM($B$14:$B$14),0))","v":""},{"$f":"IF(ROW(B20)-1>=$D$14,\"\",OFFSET(INDIRECT(MID(CELL(\"filename\",Sheet1!$A$15),FIND(\"]\",CELL(\"filename\",Sheet1!$A$15))+1,31)&\"!\"&ADDRESS(MATCH(Sheet9!$D$9,Sheet1!C:C,0)+1,3,4)),ROW(B20)-1+SUM($B$14:$C$14),0))","v":""},{"$f":"IF(ROW(B20)-1>=$E$14,\"\",OFFSET(INDIRECT(MID(CELL(\"filename\",Sheet1!$A$15),FIND(\"]\",CELL(\"filename\",Sheet1!$A$15))+1,31)&\"!\"&ADDRESS(MATCH(Sheet9!$D$9,Sheet1!C:C,0)+1,3,4)),ROW(B20)-1+SUM($B$14:$D$14),0))","v":""},""]
[]
[null,"परीक्षा प्रभारी",null,null,"केन्द्राधीक्षक "]
[null,{"$f":"Sheet2!$B$37","v":"XYZ (Lecturer)"},null,null,{"$f":"Sheet2!$E$37","v":"XYZ (Principal)"}]

{"sheet":"Sheet11","index":10,"n_rows":37,"n_cols":6,"rows_kept":37,"merged":[[0,1,0,4],[1,1,1,4],[2,1,2,4],[3,1,3,4],[4,1,4,4],[5,1,5,4],[7,1,7,4],[8,1,8,2],[8,3,8,4],[9,1,9,4],[10,1,10,4],[11,1,11,4]]}
[null,{"$f":"Sheet2!$B$1","v":"Half Yearly Examination 2024"}]
[null,"परीक्षा केंद्र नाम एवं परीक्षा केंद्र क्रमांक"]
[null,{"$f":"Sheet2!$B$3","v":"Govt Sr Sc School Malutana (216405)"}]
[null,"परीक्षा कक्ष / हॉल क्रमांक"]
[null,{"$f":"Sheet2!$K$10","v":10}]
[null,"परीक्षा दिनांक (दिवस) ... से ... तक"]
[null,{"$f":"Sheet2!$B$7","v":"14-12-2024"},{"$f":"IF(B7=\"\",\"\",TEXT(B7,\"DDDD\"))","v":"Saturday"},{"$f":"Sheet2!$D$7","v":"24-12-2024"},{"$f":"IF(D7=\"\",\"\",TEXT(D7,\"DDDD\"))","v":"Tuesday"}]
[null,"परीक्षार्थी रोल नंबर ... से ... तक"]
[null,{"$f":"IF(B14>0,B15,IF(C14>0,C15,IF(D14>0,D15,IF(E14>0,E15,0))))","v":209},null,{"$f":"IF(E14>0,LOOKUP(2,1/(E15:E34<>\"\"),E15:E34),IF(D14>0,LOOKUP(2,1/(D15:D34<>\"\"),D15:D34),IF(C14>0,LOOKUP(2,1/(C15:C34<>\"\"),C15:C34),IF(B14>0,LOOKUP(2,1/(B15:B34<>\"\"),B15:B34),0))))","v":213}]
[null,"कुल सम्मिलित परीक्षार्थी "]
[null,{"$f":"COUNTIF($B$15:$E$34,\">0\")","v":13}]
[null,"परीक्षार्थी बैठक व्यवस्था"]
[null,"पंक्ति 1","पंक्ति 2","पंक्ति 3","पंक्ति 4"]
[null,{"$f":"Sheet2!L10","v":1},{"$f":"Sheet2!M10","v":1},{"$f":"Sheet2!N10","v":2},{"$f":"Sheet2!O10","v":9}]
[null,{"$f":"IF(ROW(B1)-1>=$B$14,\"\",OFFSET(INDIRECT(MID(CELL(\"filename\",Sheet1!$A$15),FIND(\"]\",CELL(\"filename\",Sheet1!$A$15))+1,31)&\"!\"&ADDRESS(MATCH(Sheet10!$D$9,Sheet1!C:C,0)+1,3,4)),ROW(B1)-1,0))","v":209},{"$f":"IF(ROW(B1)-1>=$C$14,\"\",OFFSET(INDIRECT(MID(CELL(\"filename\",Sheet1!$A$15),FIND(\"]\",CELL(\"filename\",Sheet1!$A$15))+1,31)&\"!\"&ADDRESS(MATCH(Sheet10!$D$9,Sheet1!C:C,0)+1,3,4)),ROW(B1)-1+SUM($B$14:$B$14),0))","v":1109},{"$f":"IF(ROW(B1)-1>=$D$14,\"\",OFFSET(INDIRECT(MID(CELL(\"filename\",Sheet1!$A$15),FIND(\"]\",CELL(\"filename\",Sheet1!$A$15))+1,31)&\"!\"&ADDRESS(MATCH(Sheet10!$D$9,Sheet1!C:C,0)+1,3,4)),ROW(B1)-1+SUM($B$14:$C$14),0))","v":2109},{"$f":"IF(ROW(B1)-1>=$E$14,\"\",OFFSET(INDIRECT(MID(CELL(\"filename\",Sheet1!$A$15),FIND(\"]\",CELL(\"filename\",Sheet1!$A$15))+1,31)&\"!\"&ADDRESS(MATCH(Sheet10!$D$9,Sheet1!C:C,0)+1,3,4)),ROW(B1)-1+SUM($B$14:$D$14),0))","v":1110},{"$f":"IF(SUM(B15:E15)>0,1,\"\")","v":1}]
[null,{"$f":"IF(ROW(B2)-1>=$B$14,\"\",OFFSET(INDIRECT(MID(CELL(\"filename\",Sheet1!$A$15),FIND(\"]\",CELL(\"filename\",Sheet1!$A$15))+1,31)&\"!\"&ADDRESS(MATCH(Sheet10!$D$9,Sheet1!C:C,0)+1,3,4)),ROW(B2)-1,0))","v":""},{"$f":"IF(ROW(B2)-1>=$C$14,\"\",OFFSET(INDIRECT(MID(CELL(\"filename\",Sheet1!$A$15),FIND(\"]\",CELL(\"filename\",Sheet1!$A$15))+1,31)&\"!\"&ADDRESS(MATCH(Sheet10!$D$9,Sheet1!C:C,0)+1,3,4)),ROW(B2)-1+SUM($B$14:$B$14),0))","v":""},{"$f":"IF(ROW(B2)-1>=$D$14,\"\",OFFSET(INDIRECT(MID(CELL(\"filename\",Sheet1!$A$15),FIND(\"]\",CELL(\"filename\",Sheet1!$A$15))+1,31)&\"!\"&ADDRESS(MATCH(Sheet10!$D$9,Sheet1!C:C,0)+1,3,4)),ROW(B2)-1+SUM($B$14:$C$14),0))","v":210},{"$f":"IF(ROW(B2)-1>=$E$14,\"\",OFFSET(INDIRECT(MID(CELL(\"filename\",Sheet1!$A$15),FIND(\"]\",CELL(\"filename\",Sheet1!$A$15))+1,31)&\"!\"&ADDRESS(MATCH(Sheet10!$D$9,Sheet1!C:C,0)+1,3,4)),ROW(B2)-1+SUM($B$14:$D$14),0))","v":2110},{"$f":"IF(SUM(B16:E16)>0,1,\"\")","v":1}]
[null,{"$f":"IF(ROW(B3)-1>=$B$14,\"\",OFFSET(INDIRECT(MID(CELL(\"filename\",Sheet1!$A$15),FIND(\"]\",CELL(\"filename\",Sheet1!$A$15))+1,31)&\"!\"&ADDRESS(MATCH(Sheet10!$D$9,Sheet1!C:C,0)+1,3,4)),ROW(B3)-1,0))","v":""},{"$f":"IF(ROW(B3)-1>=$C$14,\"\",OFFSET(INDIRECT(MID(CELL(\"filename\",Sheet1!$A$15),FIND(\"]\",CELL(\"filename\",Sheet1!$A$15))+1,31)&\"!\"&ADDRESS(MATCH(Sheet10!$D$9,Sheet1!C:C,0)+1,3,4)),ROW(B3)-1+SUM($B$14:$B$14),0))","v":""},{"$f":"IF(ROW(B3)-1>=$D$14,\"\",OFFSET(INDIRECT(MID(CELL(\"filename\",Sheet1!$A$15),FIND(\"]\",CELL(\"filename\",Sheet1!$A$15))+1,31)&\"!\"&ADDRESS(MATCH(Sheet10!$D$9,Sheet1!C:C,0)+1,3,4)),ROW(B3)-1+SUM($B$14:$C$14),0))","v":""},{"$f":"IF(ROW(B3)-1>=$E$14,\"\",OFFSET(INDIRECT(MID(CELL(\"filename\",Sheet1!$A$15),FIND(\"]\",CELL(\"filename\",Sheet1!$A$15))+1,31)&\"!\"&ADDRESS(MATCH(Sheet10!$D$9,Sheet1!C:C,0)+1,3,4)),ROW(B3)-1+SUM($B$14:$D$14),0))","v":211},1]
[null,{"$f":"IF(ROW(B4)-1>=$B$14,\"\",OFFSET(INDIRECT(MID(CELL(\"filename\",Sheet1!$A$15),FIND(\"]\",CELL(\"filename\",Sheet1!$A$15))+1,31)&\"!\"&ADDRESS(MATCH(Sheet10!$D$9,Sheet1!C:C,0)+1,3,4)),ROW(B4)-1,0))","v":""},{"$f":"IF(ROW(B4)-1>=$C$14,\"\",OFFSET(INDIRECT(MID(CELL(\"filename\",Sheet1!$A$15),FIND(\"]\",CELL(\"filename\",Sheet1!$A$15))+1,31)&\"!\"&ADDRESS(MATCH(Sheet10!$D$9,Sheet1!C:C,0)+1,3,4)),ROW(B4)-1+SUM($B$14:$B$14),0))","v":""},{"$f":"IF(ROW(B4)-1>=$D$14,\"\",OFFSET(INDIRECT(MID(CELL(\"filename\",Sheet1!$A$15),FIND(\"]\",CELL(\"filename\",Sheet1!$A$15))+1,31)&\"!\"&ADDRESS(MATCH(Sheet10!$D$9,Sheet1!C:C,0)+1,3,4)),ROW(B4)-1+SUM($B$14:$C$14),0))","v":""},{"$f":"IF(ROW(B4)-1>=$E$14,\"\",OFFSET(INDIRECT(MID(CELL(\"filename\",Sheet1!$A$15),FIND(\"]\",CELL(\"filename\",Sheet1!$A$15))+1,31)&\"!\"&ADDRESS(MATCH(Sheet10!$D$9,Sheet1!C:C,0)+1,3,4)),ROW(B4)-1+SUM($B$14:$D$14),0))","v":1111},1]
[null,{"$f":"IF(ROW(B5)-1>=$B$14,\"\",OFFSET(INDIRECT(MID(CELL(\"filename\",Sheet1!$A$15),FIND(\"]\",CELL(\"filename\",Sheet1!$A$15))+1,31)&\"!\"&ADDRESS(MATCH(Sheet10!$D$9,Sheet1!C:C,0)+1,3,4)),ROW(B5)-1,0))","v":""},{"$f":"IF(ROW(B5)-1>=$C$14,\"\",OFFSET(INDIRECT(MID(CELL(\"filename\",Sheet1!$A$15),FIND(\"]\",CELL(\"filename\",Sheet1!$A$15))+1,31)&\"!\"&ADDRESS(MATCH(Sheet10!$D$9,Sheet1!C:C,0)+1,3,4)),ROW(B5)-1+SUM($B$14:$B$14),0))","v":""},{"$f":"IF(ROW(B5)-1>=$D$14,\"\",OFFSET(INDIRECT(MID(CELL(\"filename\",Sheet1!$A$15),FIND(\"]\",CELL(\"filename\",Sheet1!$A$15))+1,31)&\"!\"&ADDRESS(MATCH(Sheet10!$D$9,Sheet1!C:C,0)+1,3,4)),ROW(B5)-1+SUM($B$14:$C$14),0))","v":""},{"$f":"IF(ROW(B5)-1>=$E$14,\"\",OFFSET(INDIRECT(MID(CELL(\"filename\",Sheet1!$A$15),FIND(\"]\",CELL(\"filename\",Sheet1!$A$15))+1,31)&\"!\"&ADDRESS(MATCH(Sheet10!$D$9,Sheet1!C:C,0)+1,3,4)),ROW(B5)-1+SUM($B$14:$D$14),0))","v":2111},1]
[null,{"$f":"IF(ROW(B6)-1>=$B$14,\"\",OFFSET(INDIRECT(MID(CELL(\"filename\",Sheet1!$A$15),FIND(\"]\",CELL(\"filename\",Sheet1!$A$15))+1,31)&\"!\"&ADDRESS(MATCH(Sheet10!$D$9,Sheet1!C:C,0)+1,3,4)),ROW(B6)-1,0))","v":""},{"$f":"IF(ROW(B6)-1>=$C$14,\"\",OFFSET(INDIRECT(MID(CELL(\"filename\",Sheet1!$A$15),FIND(\"]\",CELL(\"filename\",Sheet1!$A$15))+1,31)&\"!\"&ADDRESS(MATCH(Sheet10!$D$9,Sheet1!C:C,0)+1,3,4)),ROW(B6)-1+SUM($B$14:$B$14),0))","v":""},{"$f":"IF(ROW(B6)-1>=$D$14,\"\",OFFSET(INDIRECT(MID(CELL(\"filename\",Sheet1!$A$15),FIND(\"]\",CELL(\"filename\",Sheet1!$A$15))+1,31)&\"!\"&ADDRESS(MATCH(Sheet10!$D$9,Sheet1!C:C,0)+1,3,4)),ROW(B6)-1+SUM($B$14:$C$14),0))","v":""},{"$f":"IF(ROW(B6)-1>=$E$14,\"\",OFFSET(INDIRECT(MID(CELL(\"filename\",Sheet1!$A$15),FIND(\"]\",CELL(\"filename\",Sheet1!$A$15))+1,31)&\"!\"&ADDRESS(MATCH(Sheet10!$D$9,Sheet1!C:C,0)+1,3,4)),ROW(B6)-1+SUM($B$14:$D$14),0))","v":212},1]
[null,{"$f":"IF(ROW(B7)-1>=$B$14,\"\",OFFSET(INDIRECT(MID(CELL(\"filename\",Sheet1!$A$15),FIND(\"]\",CELL(\"filename\",Sheet1!$A$15))+1,31)&\"!\"&ADDRESS(MATCH(Sheet10!$D$9,Sheet1!C:C,0)+1,3,4)),ROW(B7)-1,0))","v":""},{"$f":"IF(ROW(B7)-1>=$C$14,\"\",OFFSET(INDIRECT(MID(CELL(\"filename\",Sheet1!$A$15),FIND(\"]\",CELL(\"filename\",Sheet1!$A$15))+1,31)&\"!\"&ADDRESS(MATCH(Sheet10!$D$9,Sheet1!C:C,0)+1,3,4)),ROW(B7)-1+SUM($B$14:$B$14),0))","v":""},{"$f":"IF(ROW(B7)-1>=$D$14,\"\",OFFSET(INDIRECT(MID(CELL(\"filename\",Sheet1!$A$15),FIND(\"]\",CELL(\"filename\",Sheet1!$A$15))+1,31)&\"!\"&ADDRESS(MATCH(Sheet10!$D$9,Sheet1!C:C,0)+1,3,4)),ROW(B7)-1+SUM($B$14:$C$14),0))","v":""},{"$f":"IF(ROW(B7)-1>=$E$14,\"\",OFFSET(INDIRECT(MID(CELL(\"filename\",Sheet1!$A$15),FIND(\"]\",CELL(\"filename\",Sheet1!$A$15))+1,31)&\"!\"&ADDRESS(MATCH(Sheet10!$D$9,Sheet1!C:C,0)+1,3,4)),ROW(B7)-1+SUM($B$14:$D$14),0))","v":1112},1]
[null,{"$f":"IF(ROW(B8)-1>=$B$14,\"\",OFFSET(INDIRECT(MID(CELL(\"filename\",Sheet1!$A$15),FIND(\"]\",CELL(\"filename\",Sheet1!$A$15))+1,31)&\"!\"&ADDRESS(MATCH(Sheet10!$D$9,Sheet1!C:C,0)+1,3,4)),ROW(B8)-1,0))","v":""},{"$f":"IF(ROW(B8)-1>=$C$14,\"\",OFFSET(INDIRECT(MID(CELL(\"filename\",Sheet1!$A$15),FIND(\"]\",CELL(\"filename\",Sheet1!$A$15))+1,31)&\"!\"&ADDRESS(MATCH(Sheet10!$D$9,Sheet1!C:C,0)+1,3,4)),ROW(B8)-1+SUM($B$14:$B$14),0))","v":""},{"$f":"IF(ROW(B8)-1>=$D$14,\"\",OFFSET(INDIRECT(MID(CELL(\"filename\",Sheet1!$A$15),FIND(\"]\",CELL(\"filename\",Sheet1!$A$15))+1,31)&\"!\"&ADDRESS(MATCH(Sheet10!$D$9,Sheet1!C:C,0)+1,3,4)),ROW(B8)-1+SUM($B$14:$C$14),0))","v":""},{"$f":"IF(ROW(B8)-1>=$E$14,\"\",OFFSET(INDIRECT(MID(CELL(\"filename\",Sheet1!$A$15),FIND(\"]\",CELL(\"filename\",Sheet1!$A$15))+1,31)&\"!\"&ADDRESS(MATCH(Sheet10!$D$9,Sheet1!C:C,0)+1,3,4)),ROW(B8)-1+SUM($B$14:$D$14),0))","v":2112},1]
[null,{"$f":"IF(ROW(B9)-1>=$B$14,\"\",OFFSET(INDIRECT(MID(CELL(\"filename\",Sheet1!$A$15),FIND(\"]\",CELL(\"filename\",Sheet1!$A$15))+1,31)&\"!\"&ADDRESS(MATCH(Sheet10!$D$9,Sheet1!C:C,0)+1,3,4)),ROW(B9)-1,0))","v":""},{"$f":"IF(ROW(B9)-1>=$C$14,\"\",OFFSET(INDIRECT(MID(CELL(\"filename\",Sheet1!$A$15),FIND(\"]\",CELL(\"filename\",Sheet1!$A$15))+1,31)&\"!\"&ADDRESS(MATCH(Sheet10!$D$9,Sheet1!C:C,0)+1,3,4)),ROW(B9)-1+SUM($B$14:$B$14),0))","v":""},{"$f":"IF(ROW(B9)-1>=$D$14,\"\",OFFSET(INDIRECT(MID(CELL(\"filename\",Sheet1!$A$15),FIND(\"]\",CELL(\"filename\",Sheet1!$A$15))+1,31)&\"!\"&ADDRESS(MATCH(Sheet10!$D$9,Sheet1!C:C,0)+1,3,4)),ROW(B9)-1+SUM($B$14:$C$14),0))","v":""},{"$f":"IF(ROW(B9)-1>=$E$14,\"\",OFFSET(INDIRECT(MID(CELL(\"filename\",Sheet1!$A$15),FIND(\"]\",CELL(\"filename\",Sheet1!$A$15))+1,31)&\"!\"&ADDRESS(MATCH(Sheet10!$D$9,Sheet1!C:C,0)+1,3,4)),ROW(B9)-1+SUM($B$14:$D$14),0))","v":213},1]
[null,{"$f":"IF(ROW(B10)-1>=$B$14,\"\",OFFSET(INDIRECT(MID(CELL(\"filename\",Sheet1!$A$15),FIND(\"]\",CELL(\"filename\",Sheet1!$A$15))+1,31)&\"!\"&ADDRESS(MATCH(Sheet10!$D$9,Sheet1!C:C,0)+1,3,4)),ROW(B10)-1,0))","v":""},{"$f":"IF(ROW(B10)-1>=$C$14,\"\",OFFSET(INDIRECT(MID(CELL(\"filename\",Sheet1!$A$15),FIND(\"]\",CELL(\"filename\",Sheet1!$A$15))+1,31)&\"!\"&ADDRESS(MATCH(Sheet10!$D$9,Sheet1!C:C,0)+1,3,4)),ROW(B10)-1+SUM($B$14:$B$14),0))","v":""},{"$f":"IF(ROW(B10)-1>=$D$14,\"\",OFFSET(INDIRECT(MID(CELL(\"filename\",Sheet1!$A$15),FIND(\"]\",CELL(\"filename\",Sheet1!$A$15))+1,31)&\"!\"&ADDRESS(MATCH(Sheet10!$D$9,Sheet1!C:C,0)+1,3,4)),ROW(B10)-1+SUM($B$14:$C$14),0))","v":""},{"$f":"IF(ROW(B10)-1>=$E$14,\"\",OFFSET(INDIRECT(MID(CELL(\"filename\",Sheet1!$A$15),FIND(\"]\",CELL(\"filename\",Sheet1!$A$15))+1,31)&\"!\"&ADDRESS(MATCH(Sheet10!$D$9,Sheet1!C:C,0)+1,3,4)),ROW(B10)-1+SUM($B$14:$D$14),0))","v":""},""]
[null,{"$f":"IF(ROW(B11)-1>=$B$14,\"\",OFFSET(INDIRECT(MID(CELL(\"filename\",Sheet1!$A$15),FIND(\"]\",CELL(\"filename\",Sheet1!$A$15))+1,31)&\"!\"&ADDRESS(MATCH(Sheet10!$D$9,Sheet1!C:C,0)+1,3,4)),ROW(B11)-1,0))","v":""},{"$f":"IF(ROW(B11)-1>=$C$14,\"\",OFFSET(INDIRECT(MID(CELL(\"filename\",Sheet1!$A$15),FIND(\"]\",CELL(\"filename\",Sheet1!$A$15))+1,31)&\"!\"&ADDRESS(MATCH(Sheet10!$D$9,Sheet1!C:C,0)+1,3,4)),ROW(B11)-1+SUM($B$14:$B$14),0))","v":""},{"$f":"IF(ROW(B11)-1>=$D$14,\"\",OFFSET(INDIRECT(MID(CELL(\"filename\",Sheet1!$A$15),FIND(\"]\",CELL(\"filename\",Sheet1!$A$15))+1,31)&\"!\"&ADDRESS(MATCH(Sheet10!$D$9,Sheet1!C:C,0)+1,3,4)),ROW(B11)-1+SUM($B$14:$C$14),0))","v":""},{"$f":"IF(ROW(B11)-1>=$E$14,\"\",OFFSET(INDIRECT(MID(CELL(\"filename\",Sheet1!$A$15),FIND(\"]\",CELL(\"filename\",Sheet1!$A$15))+1,31)&\"!\"&ADDRESS(MATCH(Sheet10!$D$9,Sheet1!C:C,0)+1,3,4)),ROW(B11)-1+SUM($B$14:$D$14),0))","v":""},""]
[null,{"$f":"IF(ROW(B12)-1>=$B$14,\"\",OFFSET(INDIRECT(MID(CELL(\"filename\",Sheet1!$A$15),FIND(\"]\",CELL(\"filename\",Sheet1!$A$15))+1,31)&\"!\"&ADDRESS(MATCH(Sheet10!$D$9,Sheet1!C:C,0)+1,3,4)),ROW(B12)-1,0))","v":""},{"$f":"IF(ROW(B12)-1>=$C$14,\"\",OFFSET(INDIRECT(MID(CELL(\"filename\",Sheet1!$A$15),FIND(\"]\",CELL(\"filename\",Sheet1!$A$15))+1,31)&\"!\"&ADDRESS(MATCH(Sheet10!$D$9,Sheet1!C:C,0)+1,3,4)),ROW(B12)-1+SUM($B$14:$B$14),0))","v":""},{"$f":"IF(ROW(B12)-1>=$D$14,\"\",OFFSET(INDIRECT(MID(CELL(\"filename\",Sheet1!$A$15),FIND(\"]\",CELL(\"filename\",Sheet1!$A$15))+1,31)&\"!\"&ADDRESS(MATCH(Sheet10!$D$9,Sheet1!C:C,0)+1,3,4)),ROW(B12)-1+SUM($B$14:$C$14),0))","v":""},{"$f":"IF(ROW(B12)-1>=$E$14,\"\",OFFSET(INDIRECT(MID(CELL(\"filename\",Sheet1!$A$15),FIND(\"]\",CELL(\"filename\",Sheet1!$A$15))+1,31)&\"!\"&ADDRESS(MATCH(Sheet10!$D$9,Sheet1!C:C,0)+1,3,4)),ROW(B12)-1+SUM($B$14:$D$14),0))","v":""},""]
[null,{"$f":"IF(ROW(B13)-1>=$B$14,\"\",OFFSET(INDIRECT(MID(CELL(\"filename\",Sheet1!$A$15),FIND(\"]\",CELL(\"filename\",Sheet1!$A$15))+1,31)&\"!\"&ADDRESS(MATCH(Sheet10!$D$9,Sheet1!C:C,0)+1,3,4)),ROW(B13)-1,0))","v":""},{"$f":"IF(ROW(B13)-1>=$C$14,\"\",OFFSET(INDIRECT(MID(CELL(\"filename\",Sheet1!$A$15),FIND(\"]\",CELL(\"filename\",Sheet1!$A$15))+1,31)&\"!\"&ADDRESS(MATCH(Sheet10!$D$9,Sheet1!C:C,0)+1,3,4)),ROW(B13)-1+SUM($B$14:$B$14),0))","v":""},{"$f":"IF(ROW(B13)-1>=$D$14,\"\",OFFSET(INDIRECT(MID(CELL(\"filename\",Sheet1!$A$15),FIND(\"]\",CELL(\"filename\",Sheet1!$A$15))+1,31)&\"!\"&ADDRESS(MATCH(Sheet10!$D$9,Sheet1!C:C,0)+1,3,4)),ROW(B13)-1+SUM($B$14:$C$14),0))","v":""},{"$f":"IF(ROW(B13)-1>=$E$14,\"\",OFFSET(INDIRECT(MID(CELL(\"filename\",Sheet1!$A$15),FIND(\"]\",CELL(\"filename\",Sheet1!$A$15))+1,31)&\"!\"&ADDRESS(MATCH(Sheet10!$D$9,Sheet1!C:C,0)+1,3,4)),ROW(B13)-1+SUM($B$14:$D$14),0))","v":""},""]
[null,{"$f":"IF(ROW(B14)-1>=$B$14,\"\",OFFSET(INDIRECT(MID(CELL(\"filename\",Sheet1!$A$15),FIND(\"]\",CELL(\"filename\",Sheet1!$A$15))+1,31)&\"!\"&ADDRESS(MATCH(Sheet10!$D$9,Sheet1!C:C,0)+1,3,4)),ROW(B14)-1,0))","v":""},{"$f":"IF(ROW(B14)-1>=$C$14,\"\",OFFSET(INDIRECT(MID(CELL(\"filename\",Sheet1!$A$15),FIND(\"]\",CELL(\"filename\",Sheet1!$A$15))+1,31)&\"!\"&ADDRESS(MATCH(Sheet10!$D$9,Sheet1!C:C,0)+1,3,4)),ROW(B14)-1+SUM($B$14:$B$14),0))","v":""},{"$f":"IF(ROW(B14)-1>=$D$14,\"\",OFFSET(INDIRECT(MID(CELL(\"filename\",Sheet1!$A$15),FIND(\"]\",CELL(\"filename\",Sheet1!$A$15))+1,31)&\"!\"&ADDRESS(MATCH(Sheet10!$D$9,Sheet1!C:C,0)+1,3,4)),ROW(B14)-1+SUM($B$14:$C$14),0))","v":""},{"$f":"IF(ROW(B14)-1>=$E$14,\"\",OFFSET(INDIRECT(MID(CELL(\"filename\",Sheet1!$A$15),FIND(\"]\",CELL(\"filename\",Sheet1!$A$15))+1,31)&\"!\"&ADDRESS(MATCH(Sheet10!$D$9,Sheet1!C:C,0)+1,3,4)),ROW(B14)-1+SUM($B$14:$D$14),0))","v":""},""]
[null,{"$f":"IF(ROW(B15)-1>=$B$14,\"\",OFFSET(INDIRECT(MID(CELL(\"filename\",Sheet1!$A$15),FIND(\"]\",CELL(\"filename\",Sheet1!$A$15))+1,31)&\"!\"&ADDRESS(MATCH(Sheet10!$D$9,Sheet1!C:C,0)+1,3,4)),ROW(B15)-1,0))","v":""},{"$f":"IF(ROW(B15)-1>=$C$14,\"\",OFFSET(INDIRECT(MID(CELL(\"filename\",Sheet1!$A$15),FIND(\"]\",CELL(\"filename\",Sheet1!$A$15))+1,31)&\"!\"&ADDRESS(MATCH(Sheet10!$D$9,Sheet1!C:C,0)+1,3,4)),ROW(B15)-1+SUM($B$14:$B$14),0))","v":""},{"$f":"IF(ROW(B15)-1>=$D$14,\"\",OFFSET(INDIRECT(MID(CELL(\"filename\",Sheet1!$A$15),FIND(\"]\",CELL(\"filename\",Sheet1!$A$15))+1,31)&\"!\"&ADDRESS(MATCH(Sheet10!$D$9,Sheet1!C:C,0)+1,3,4)),ROW(B15)-1+SUM($B$14:$C$14),0))","v":""},{"$f":"IF(ROW(B15)-1>=$E$14,\"\",OFFSET(INDIRECT(MID(CELL(\"filename\",Sheet1!$A$15),FIND(\"]\",CELL(\"filename\",Sheet1!$A$15))+1,31)&\"!\"&ADDRESS(MATCH(Sheet10!$D$9,Sheet1!C:C,0)+1,3,4)),ROW(B15)-1+SUM($B$14:$D$14),0))","v":""},""]
[null,{"$f":"IF(ROW(B16)-1>=$B$14,\"\",OFFSET(INDIRECT(MID(CELL(\"filename\",Sheet1!$A$15),FIND(\"]\",CELL(\"filename\",Sheet1!$A$15))+1,31)&\"!\"&ADDRESS(MATCH(Sheet10!$D$9,Sheet1!C:C,0)+1,3,4)),ROW(B16)-1,0))","v":""},{"$f":"IF(ROW(B16)-1>=$C$14,\"\",OFFSET(INDIRECT(MID(CELL(\"filename\",Sheet1!$A$15),FIND(\"]\",CELL(\"filename\",Sheet1!$A$15))+1,31)&\"!\"&ADDRESS(MATCH(Sheet10!$D$9,Sheet1!C:C,0)+1,3,4)),ROW(B16)-1+SUM($B$14:$B$14),0))","v":""},{"$f":"IF(ROW(B16)-1>=$D$14,\"\",OFFSET(INDIRECT(MID(CELL(\"filename\",Sheet1!$A$15),FIND(\"]\",CELL(\"filename\",Sheet1!$A$15))+1,31)&\"!\"&ADDRESS(MATCH(Sheet10!$D$9,Sheet1!C:C,0)+1,3,4)),ROW(B16)-1+SUM($B$14:$C$14),0))","v":""},{"$f":"IF(ROW(B16)-1>=$E$14,\"\",OFFSET(INDIRECT(MID(CELL(\"filename\",Sheet1!$A$15),FIND(\"]\",CELL(\"filename\",Sheet1!$A$15))+1,31)&\"!\"&ADDRESS(MATCH(Sheet10!$D$9,Sheet1!C:C,0)+1,3,4)),ROW(B16)-1+SUM($B$14:$D$14),0))","v":""},""]
[null,{"$f":"IF(ROW(B17)-1>=$B$14,\"\",OFFSET(INDIRECT(MID(CELL(\"filename\",Sheet1!$A$15),FIND(\"]\",CELL(\"filename\",Sheet1!$A$15))+1,31)&\"!\"&ADDRESS(MATCH(Sheet10!$D$9,Sheet1!C:C,0)+1,3,4)),ROW(B17)-1,0))","v":""},{"$f":"IF(ROW(B17)-1>=$C$14,\"\",OFFSET(INDIRECT(MID(CELL(\"filename\",Sheet1!$A$15),FIND(\"]\",CELL(\"filename\",Sheet1!$A$15))+1,31)&\"!\"&ADDRESS(MATCH(Sheet10!$D$9,Sheet1!C:C,0)+1,3,4)),ROW(B17)-1+SUM($B$14:$B$14),0))","v":""},{"$f":"IF(ROW(B17)-1>=$D$14,\"\",OFFSET(INDIRECT(MID(CELL(\"filename\",Sheet1!$A$15),FIND(\"]\",CELL(\"filename\",Sheet1!$A$15))+1,31)&\"!\"&ADDRESS(MATCH(Sheet10!$D$9,Sheet1!C:C,0)+1,3,4)),ROW(B17)-1+SUM($B$14:$C$14),0))","v":""},{"$f":"IF(ROW(B17)-1>=$E$14,\"\",OFFSET(INDIRECT(MID(CELL(\"filename\",Sheet1!$A$15),FIND(\"]\",CELL(\"filename\",Sheet1!$A$15))+1,31)&\"!\"&ADDRESS(MATCH(Sheet10!$D$9,Sheet1!C:C,0)+1,3,4)),ROW(B17)-1+SUM($B$14:$D$14),0))","v":""},""]
[null,{"$f":"IF(ROW(B18)-1>=$B$14,\"\",OFFSET(INDIRECT(MID(CELL(\"filename\",Sheet1!$A$15),FIND(\"]\",CELL(\"filename\",Sheet1!$A$15))+1,31)&\"!\"&ADDRESS(MATCH(Sheet10!$D$9,Sheet1!C:C,0)+1,3,4)),ROW(B18)-1,0))","v":""},{"$f":"IF(ROW(B18)-1>=$C$14,\"\",OFFSET(INDIRECT(MID(CELL(\"filename\",Sheet1!$A$15),FIND(\"]\",CELL(\"filename\",Sheet1!$A$15))+1,31)&\"!\"&ADDRESS(MATCH(Sheet10!$D$9,Sheet1!C:C,0)+1,3,4)),ROW(B18)-1+SUM($B$14:$B$14),0))","v":""},{"$f":"IF(ROW(B18)-1>=$D$14,\"\",OFFSET(INDIRECT(MID(CELL(\"filename\",Sheet1!$A$15),FIND(\"]\",CELL(\"filename\",Sheet1!$A$15))+1,31)&\"!\"&ADDRESS(MATCH(Sheet10!$D$9,Sheet1!C:C,0)+1,3,4)),ROW(B18)-1+SUM($B$14:$C$14),0))","v":""},{"$f":"IF(ROW(B18)-1>=$E$14,\"\",OFFSET(INDIRECT(MID(CELL(\"filename\",Sheet1!$A$15),FIND(\"]\",CELL(\"filename\",Sheet1!$A$15))+1,31)&\"!\"&ADDRESS(MATCH(Sheet10!$D$9,Sheet1!C:C,0)+1,3,4)),ROW(B18)-1+SUM($B$14:$D$14),0))","v":""},""]
[null,{"$f":"IF(ROW(B19)-1>=$B$14,\"\",OFFSET(INDIRECT(MID(CELL(\"filename\",Sheet1!$A$15),FIND(\"]\",CELL(\"filename\",Sheet1!$A$15))+1,31)&\"!\"&ADDRESS(MATCH(Sheet10!$D$9,Sheet1!C:C,0)+1,3,4)),ROW(B19)-1,0))","v":""},{"$f":"IF(ROW(B19)-1>=$C$14,\"\",OFFSET(INDIRECT(MID(CELL(\"filename\",Sheet1!$A$15),FIND(\"]\",CELL(\"filename\",Sheet1!$A$15))+1,31)&\"!\"&ADDRESS(MATCH(Sheet10!$D$9,Sheet1!C:C,0)+1,3,4)),ROW(B19)-1+SUM($B$14:$B$14),0))","v":""},{"$f":"IF(ROW(B19)-1>=$D$14,\"\",OFFSET(INDIRECT(MID(CELL(\"filename\",Sheet1!$A$15),FIND(\"]\",CELL(\"filename\",Sheet1!$A$15))+1,31)&\"!\"&ADDRESS(MATCH(Sheet10!$D$9,Sheet1!C:C,0)+1,3,4)),ROW(B19)-1+SUM($B$14:$C$14),0))","v":""},{"$f":"IF(ROW(B19)-1>=$E$14,\"\",OFFSET(INDIRECT(MID(CELL(\"filename\",Sheet1!$A$15),FIND(\"]\",CELL(\"filename\",Sheet1!$A$15))+1,31)&\"!\"&ADDRESS(MATCH(Sheet10!$D$9,Sheet1!C:C,0)+1,3,4)),ROW(B19)-1+SUM($B$14:$D$14),0))","v":""},""]
[null,{"$f":"IF(ROW(B20)-1>=$B$14,\"\",OFFSET(INDIRECT(MID(CELL(\"filename\",Sheet1!$A$15),FIND(\"]\",CELL(\"filename\",Sheet1!$A$15))+1,31)&\"!\"&ADDRESS(MATCH(Sheet10!$D$9,Sheet1!C:C,0)+1,3,4)),ROW(B20)-1,0))","v":""},{"$f":"IF(ROW(B20)-1>=$C$14,\"\",OFFSET(INDIRECT(MID(CELL(\"filename\",Sheet1!$A$15),FIND(\"]\",CELL(\"filename\",Sheet1!$A$15))+1,31)&\"!\"&ADDRESS(MATCH(Sheet10!$D$9,Sheet1!C:C,0)+1,3,4)),ROW(B20)-1+SUM($B$14:$B$14),0))","v":""},{"$f":"IF(ROW(B20)-1>=$D$14,\"\",OFFSET(INDIRECT(MID(CELL(\"filename\",Sheet1!$A$15),FIND(\"]\",CELL(\"filename\",Sheet1!$A$15))+1,31)&\"!\"&ADDRESS(MATCH(Sheet10!$D$9,Sheet1!C:C,0)+1,3,4)),ROW(B20)-1+SUM($B$14:$C$14),0))","v":""},{"$f":"IF(ROW(B20)-1>=$E$14,\"\",OFFSET(INDIRECT(MID(CELL(\"filename\",Sheet1!$A$15),FIND(\"]\",CELL(\"filename\",Sheet1!$A$15))+1,31)&\"!\"&ADDRESS(MATCH(Sheet10!$D$9,Sheet1!C:C,0)+1,3,4)),ROW(B20)-1+SUM($B$14:$D$14),0))","v":""},""]
[]
[null,"परीक्षा प्रभारी",null,null,"केन्द्राधीक्षक "]
[null,{"$f":"Sheet2!$B$37","v":"XYZ (Lecturer)"},null,null,{"$f":"Sheet2!$E$37","v":"XYZ (Principal)"}]

{"sheet":"Sheet12","index":11,"n_rows":27,"n_cols":5,"rows_kept":27,"merged":[[0,0,0,4],[1,0,1,4],[2,0,2,4],[3,0,3,1],[4,1,4,3],[5,1,5,3],[6,1,6,3],[7,1,7,3],[8,1,8,3],[9,1,9,3],[10,1,10,3],[11,1,11,3],[12,1,12,3],[13,1,13,3],[14,1,14,3],[15,1,15,3],[16,0,16,3],[17,0,21,0],[17,1,17,3],[18,1,18,3],[19,1,19,3],[20,1,20,3],[21,1,21,3],[22,0,22,4],[25,2,25,3],[26,2,26,3]]}
[{"$f":"Sheet13!$A$1","v":"कार्यालय प्रधानाचार्य एवं अध्यक्ष, प्रारंभिक शिक्षा पूर्णता प्रमाण पत्र परीक्षा, 2024 डाइट अलवर"}]
[{"$f":"Sheet13!$A$2","v":"Email-dietalwar@gmail.com"}]
["परीक्षा केंद्र एवं नोडल (संग्रहण) केंद्र व्यय का मदवार इकजाई विवरण"]
["परीक्षा केंद्र कोड नं. -",null,{"$f":"Sheet13!$C$4","v":80905},"परीक्षार्थी संख्यां -",{"$f":"Sheet13!$I$4","v":164}]
["क्र.सं.","मदवार व्यय",null,null,"कुल व्यय"]
[1,"केन्द्राधीक्षक का मानदेय -",null,null,{"$f":"Sheet13!$F$6","v":600}]
[2,"परीक्षा प्रभारी का मानदेय -",null,null,{"$f":"Sheet13!$F$7","v":540}]
[3,"परिवीक्षकों का मानदेय -",null,null,{"$f":"80*2*6","v":960}]
[4,"वीक्षकों का मानदेय -",null,null,{"$f":"80*7*6","v":3360}]
[5,"सहायक कर्मचारियों का मानदेय -",null,null,{"$f":"50*6*2","v":600}]
[6,"उत्तर-पुस्तिका जांच हेतु मानदेय -",null,null,0]
[7,"परीक्षा केंद्र हेतु स्टेशनरी आदि व्यय हेतु रु. 500/-",null,null,500]
[8,"नोडल (संग्रहण) केंद्र के लिए स्टेशनरी आदि व्यय हेतु रु. 1000/-",null,null,0]
[9,"उत्तर पुस्तिका परिवहन व्यय",null,null,360]
[10,"प्रश्न पत्र पेटिका परिवहन व्यय",null,null,500]
[11,"परीक्षा दिवस को पुलिस थाने से प्रश्न पत्र लाने का किराया",null,null,360]
["सर्व योग",{"$nulls":3},{"$f":"SUM(E6:E16)","v":7780}]
[null,"बैंक खाता संख्यां जिसमे राशी जमा की जानी हैं -"]
[null,"खाता धारक का नाम -"]
[null,"बैंक शाखा का नाम -"]
[null,"बैंक  IFSC कोड"]
[null,"संस्था का  TAN नंबर"]
["नोट : नोडल (संग्रहण)/ परीक्षा केंद्र बैंक पासबुक की प्रति जमा करें -"]
[]
[null,"हस्ताक्षर केन्द्राधीक्षक"]
[null,"नाम केन्द्राधीक्षक :",{"$f":"Sheet13!$C$29","v":0}]
[null,"मोबाइल नंबर : ",{"$f":"Sheet13!$C$30","v":0}]

{"sheet":"Sheet13","index":12,"n_rows":30,"n_cols":11,"rows_kept":30,"merged":[[0,0,0,10],[1,0,1,10],[2,0,2,10],[25,0,25,2],[25,6,25,10],[28,2,28,5],[29,2,29,5]]}
["कार्यालय प्रधानाचार्य एवं अध्यक्ष, प्रारंभिक शिक्षा पूर्णता प्रमाण पत्र परीक्षा, 2024 डाइट अलवर"]
["Email-dietalwar@gmail.com"]
["परीक्षा केंद्र एवं नोडल (संग्रहण) केंद्र व्यय विवरण "]
[null,"परीक्षा केंद्र कोड नंबर :",80905,{"$nulls":4},"परीक्षार्थी संख्यां :",164]
["क्र. सं.","पदनाम- केन्द्राधीक्षक/परीक्षा प्रभारी/पर्यवीक्षक/वीक्षक/सहा कर्मचारी","नाम कार्मिक","कुल दिवस ","मानदेय \nदर","कुल मानदेय ","बैंक खाता संख्यां","बैंक एवं शाखा","आई एफ एस सी कोड","एम्प्लोयी आईडी","हस्ताक्षर"]
[1,"केन्द्राधीक्षक",null,6,100,{"$f":"D6*E6","v":600}]
[2,"परीक्षा प्रभारी",null,6,90,{"$f":"D7*E7","v":540}]
[3,"वीक्षक/परिवीक्षक ",null,6,80,480]
[4,"वीक्षक/परिवीक्षक ",null,5,80,400]
[5,"वीक्षक/परिवीक्षक ",null,2,80,160]
[6,"वीक्षक/परिवीक्षक ",null,3,80,240]
[7,"वीक्षक/परिवीक्षक ",null,6,80,480]
[8,"वीक्षक/परिवीक्षक ",null,2,80,160]
[9,"वीक्षक/परिवीक्षक ",null,4,80,320]
[10,"वीक्षक/परिवीक्षक ",null,3,80,240]
[11,"वीक्षक/परिवीक्षक ",null,5,80,400]
[12,"वीक्षक/परिवीक्षक ",null,5,80,400]
[13,"वीक्षक/परिवीक्षक ",null,6,80,480]
[14,"वीक्षक/परिवीक्षक ",null,4,80,320]
[15,"वीक्षक/परिवीक्षक ",null,1,80,80]
[16,"वीक्षक/परिवीक्षक ",null,2,80,160]
[17,"वीक्षक/परिवीक्षक ",null,1,80,80]
[18,"वीक्षक/परिवीक्षक ",null,1,80,80]
[19,"सहायक कर्मचारी",null,3,50,150]
[20,"सहायक कर्मचारी",null,3,50,150]
["मानदेय का कुल योग -",null,null,{"$f":"SUM(D6:D25)","v":74},{"$f":"SUM(E6:E25)","v":1570},{"$f":"SUM(F6:F25)","v":5920}]
[]
[null,"हस्ताक्षर केन्द्राधीक्षक"]
[null,"नाम केन्द्राधीक्षक :"]
[null,"मोबाइल नंबर : "]

{"sheet":"Sheet14","index":13,"n_rows":15,"n_cols":12,"rows_kept":15,"merged":[[0,0,0,11],[1,0,1,11],[2,0,2,11],[10,0,10,3],[10,7,10,11],[13,2,13,3],[14,2,14,3]]}
[{"$f":"Sheet13!$A$1","v":"कार्यालय प्रधानाचार्य एवं अध्यक्ष, प्रारंभिक शिक्षा पूर्णता प्रमाण पत्र परीक्षा, 2024 डाइट अलवर"}]
[{"$f":"Sheet13!$A$2","v":"Email-dietalwar@gmail.com"}]
["परीक्षा केंद्र द्वारा बण्डल भेजने का व्यय विवरण "]
["क्र. सं.","कार्मिक का नाम","पद नाम ","दिनांक ","बण्डल का किराया ","कार्मिक का किराया ","कुल व्यय ","Bank Account Number","Bank Name & Branch Name","Bank IFSC","Employee ID","हस्ताक्षर"]
[1,null,"वरिष्ठ अध्या","2024-03-28",0,60,{"$f":"E5+F5","v":60}]
[2,null,"वरिष्ठ अध्या","2024-03-29",0,60,60]
[3,null,"वरिष्ठ अध्या","2024-03-30",0,60,60]
[4,null,"वरिष्ठ अध्या","2024-03-31",0,60,60]
[5,null,"वरिष्ठ अध्या","2024-04-01",0,60,60]
[6,null,"वरिष्ठ अध्या","2024-04-02",0,60,60]
["मानदेय का कुल योग ",{"$nulls":3},{"$f":"SUM(E5:E10)","v":0},360,{"$f":"SUM(G5:G10)","v":360}]
[]
[null,"हस्ताक्षर केन्द्राधीक्षक"]
[null,"नाम केन्द्राधीक्षक :",{"$f":"Sheet13!$C$29","v":0}]
[null,"मोबाइल नंबर : ",{"$f":"Sheet13!$C$30","v":0}]

{"sheet":"Sheet15","index":14,"n_rows":30,"n_cols":7,"rows_kept":30,"merged":[[1,1,1,6],[2,1,2,6],[3,1,3,6],[4,1,4,6],[5,1,6,1],[5,2,6,2],[5,3,5,5],[5,6,6,6],[7,1,8,1],[7,2,8,2],[7,6,8,6],[9,1,10,1],[9,2,10,2],[9,6,10,6],[11,1,12,1],[11,2,12,2],[11,6,12,6],[13,1,14,1],[13,2,14,2],[13,6,14,6],[15,1,16,1],[15,2,16,2],[15,6,16,6],[17,1,18,1],[17,2,18,2],[17,6,18,6],[19,1,20,1],[19,2,20,2],[19,6,20,6],[21,1,22,1],[21,2,22,2],[21,6,22,6],[23,1,24,1],[23,2,24,2],[23,6,24,6],[25,1,26,1],[25,2,26,2],[25,6,26,6]]}
[]
[null,{"$f":"Sheet2!$B$1","v":"Half Yearly Examination 2024"}]
[null,{"$f":"Sheet2!$B$2","v":"परीक्षा केंद्र नाम एवं परीक्षा केंद्र क्रमांक"}]
[null,{"$f":"Sheet2!$B$3","v":"Govt Sr Sc School Malutana (216405)"}]
[null,"परीक्षार्थी समेकित बैठक व्यवस्था"]
[null,"क्र.\nसं.","कक्ष \nक्रमांक","रोल नंबर",null,null,"कुल \nपरीक्षार्थी"]
[{"$nulls":3}," से","तक","कुल"]
[null,1,"001",null,null,{"$f":"IF(D8=\"\",\"\",E8-D8+1)","v":""},{"$f":"SUM(F8:F9)","v":0}]
[{"$nulls":5},{"$f":"IF(D9=\"\",\"\",E9-D9+1)","v":""}]
[null,2,"002",null,null,"",{"$f":"SUM(F10:F11)","v":0}]
[{"$nulls":5},""]
[null,3,"003",null,null,"",{"$f":"SUM(F12:F13)","v":0}]
[{"$nulls":5},""]
[null,4,"004",null,null,"",{"$f":"SUM(F14:F15)","v":0}]
[{"$nulls":5},""]
[null,5,"005",null,null,"",{"$f":"SUM(F16:F17)","v":0}]
[{"$nulls":5},""]
[null,6,"006",null,null,"",{"$f":"SUM(F18:F19)","v":0}]
[{"$nulls":5},""]
[null,7,"007",null,null,"",{"$f":"SUM(F20:F21)","v":0}]
[{"$nulls":5},""]
[null,8,"008",null,null,"",{"$f":"SUM(F22:F23)","v":0}]
[{"$nulls":5},""]
[null,9,"009",null,null,"",{"$f":"SUM(F24:F25)","v":0}]
[{"$nulls":5},""]
[null,10,"010",null,null,"",{"$f":"SUM(F26:F27)","v":0}]
[{"$nulls":5},""]
[]
[null,"परीक्षा प्रभारी",{"$nulls":3},"केन्द्राधीक्षक"]
[null,{"$f":"Sheet2!$B$37","v":"XYZ (Lecturer)"},{"$nulls":3},{"$f":"Sheet2!$E$37","v":"XYZ (Principal)"}]

{"sheet":"Sheet16","index":15,"n_rows":40,"n_cols":7,"rows_kept":40,"merged":[[1,1,1,6],[2,1,2,6],[3,1,3,6],[4,1,4,6],[5,1,6,1],[5,2,6,2],[5,3,5,5],[5,6,6,6],[7,1,9,1],[7,2,9,2],[7,6,9,6],[10,1,12,1],[10,2,12,2],[10,6,12,6],[13,1,15,1],[13,2,15,2],[13,6,15,6],[16,1,18,1],[16,2,18,2],[16,6,18,6],[19,1,21,1],[19,2,21,2],[19,6,21,6],[22,1,24,1],[22,2,24,2],[22,6,24,6],[25,1,27,1],[25,2,27,2],[25,6,27,6],[28,1,30,1],[28,2,30,2],[28,6,30,6],[31,1,33,1],[31,2,33,2],[31,6,33,6],[34,1,36,1],[34,2,36,2],[34,6,36,6]]}
[]
[null,{"$f":"Sheet2!$B$1","v":"Half Yearly Examination 2024"}]
[null,{"$f":"Sheet2!$B$2","v":"परीक्षा केंद्र नाम एवं परीक्षा केंद्र क्रमांक"}]
[null,{"$f":"Sheet2!$B$3","v":"Govt Sr Sc School Malutana (216405)"}]
[null,"परीक्षार्थी समेकित बैठक व्यवस्था"]
[null,"क्र.\nसं.","कक्ष \nक्रमांक","रोल नंबर",null,null,"कुल \nपरीक्षार्थी"]
[{"$nulls":3}," से","तक","कुल"]
[null,1,"001",null,null,{"$f":"IF(D8=\"\",\"\",E8-D8+1)","v":""},{"$f":"SUM(F8:F10)","v":0}]
[{"$nulls":5},{"$f":"IF(D9=\"\",\"\",E9-D9+1)","v":""}]
[{"$nulls":5},""]
[null,2,"002",null,null,"",{"$f":"SUM(F11:F13)","v":0}]
[{"$nulls":5},""]
[{"$nulls":5},""]
[null,3,"003",null,null,"",{"$f":"SUM(F14:F16)","v":0}]
[{"$nulls":5},""]
[{"$nulls":5},""]
[null,4,"004",null,null,"",{"$f":"SUM(F17:F19)","v":0}]
[{"$nulls":5},""]
[{"$nulls":5},""]
[null,5,"005",null,null,"",{"$f":"SUM(F20:F22)","v":0}]
[{"$nulls":5},""]
[{"$nulls":5},""]
[null,6,"006",null,null,"",{"$f":"SUM(F23:F25)","v":0}]
[{"$nulls":5},""]
[{"$nulls":5},""]
[null,7,"007",null,null,"",{"$f":"SUM(F26:F28)","v":0}]
[{"$nulls":5},""]
[{"$nulls":5},""]
[null,8,"008",null,null,"",{"$f":"SUM(F29:F31)","v":0}]
[{"$nulls":5},""]
[{"$nulls":5},""]
[null,9,"009",null,null,"",{"$f":"SUM(F32:F34)","v":0}]
[{"$nulls":5},""]
[{"$nulls":5},""]
[null,10,"010",null,null,"",{"$f":"SUM(F35:F37)","v":0}]
[{"$nulls":5},""]
[{"$nulls":5},""]
[]
[null,"परीक्षा प्रभारी",{"$nulls":3},"केन्द्राधीक्षक"]
[null,{"$f":"Sheet2!$B$37","v":"XYZ (Lecturer)"},{"$nulls":3},{"$f":"Sheet2!$E$37","v":"XYZ (Principal)"}]

{"sheet":"Sheet17","index":16,"n_rows":12,"n_cols":3,"rows_kept":12}
[null,null,"Examination Centre Detail"]
[]
[null,"Examination Name :"]
[null,"Exam Centre Name :"]
[null,"Exam Centre Code :"]
[null,"Superintendent Name :"]
[null,"Superintendent Desig. :"]
[null,"Exam Incharge Name :"]
[null,"Exam Incharge Desig. :"]
[null,"Examination Start Date :"]
[null,"Examination End Date :"]
[null,"Examnination Innings :"]